program: Gaussian 09
title: 000155248
version: EM64L-G09RevD.01
frameworkgroup: C1[X(C19H18O4)]
method: RPBEPBE
basis: SDD
operation: Freq
keyword: #pfreq=noraman
keyword: PBEPBE/SDD
title: #p freq=noraman PBEPBE/SDD
converged: YES YES NO NO
title: Mulliken charges:
elementType: O O O O C C C C C C C C C C C C C C C C C C C H H H H H H H H H H H H H H H H H H
charge: -0.293932 -0.448848 -0.440832 -0.432979 0.481325 0.179697 0.218409 -0.573452 0.309219 0.236707 0.217825 -0.631129 -0.643117 0.210816 -0.479367 -0.298486 -0.393917 -0.497649 0.385467 0.322240 -0.400982 -0.792272 -0.807668 0.227681 0.232079 0.257059 0.216005 0.253130 0.239406 0.245566 0.276024 0.217097 0.227222 0.212518 0.215919 0.256468 0.210612 0.215404 0.360035 0.355802 0.354896
chargesum: 0.00000
title: Mulliken charges with hydrogens summed into heavy atoms:
elementType: O O O O C C C C C C C C C C C C C C C C C C C
charge: -0.293932 -0.088813 -0.085030 -0.078083 0.481325 0.179697 0.218409 -0.113692 0.309219 0.236707 0.217825 -0.374069 -0.427112 0.210816 -0.226237 -0.059080 -0.148351 -0.221624 0.385467 0.322240 -0.183885 -0.136612 -0.125184
polarizability: 4.44529796e+02 4.52329792e+00 2.22530617e+02 1.62411139e+01 1.02962919e+01 1.22817835e+02
1716.lowfreq: -3.0298 -0.0009 0.0001 0.0006 3.4635 9.9152 23.0793 24.1135 34.3455
frequency: 23.0642 24.0025 34.3117 40.6767 61.4435 73.9784 113.0893 124.4775 150.5210 176.0192 200.8164 205.3649 222.2670 228.8372 240.8909 257.4514 283.1800 310.1471 335.0761 341.3106 350.4594 357.4728 361.0896 368.3575 370.6544 412.2384 435.8264 449.1503 464.1093 493.8476 512.6704 527.8748 538.6659 582.5553 587.4070 589.2511 607.3297 611.5212 671.8286 704.9360 732.3964 735.6145 753.5443 776.2063 785.1659 798.9710 815.7682 826.8086 852.6211 853.9719 856.8247 872.1190 898.8286 909.8186 922.3475 941.7108 950.9713 982.5938 996.4992 1025.7141 1045.6943 1083.3275 1090.1556 1108.4896 1125.1737 1137.1647 1153.5056 1161.5760 1174.1555 1193.0217 1202.8002 1219.0924 1233.0790 1235.8262 1269.2914 1279.3454 1297.0524 1301.5388 1335.1777 1353.4873 1386.3623 1397.8814 1403.7354 1411.2831 1418.0703 1441.0830 1453.8268 1457.8355 1469.2283 1471.2335 1486.7148 1500.0470 1515.8422 1587.0541 1597.6545 1604.7627 1618.5737 1640.0249 1693.0308 2954.7398 2962.0089 3002.1882 3025.6062 3029.4428 3076.5860 3085.5725 3101.0512 3106.0272 3119.4192 3125.4521 3144.9483 3157.9109 3191.4088 3222.4643 3585.7253 3586.4288 3587.1842
redmass: 4.2240 4.7696 4.5484 3.6761 4.8583 5.2702 3.9381 1.1424 6.9030 1.4287 3.3053 4.3740 4.0684 3.9794 4.9327 3.4311 5.3049 3.2438 1.1172 2.0863 1.2691 1.3095 4.2510 4.5419 2.7820 3.2338 2.9357 3.2271 4.4166 5.1255 3.0230 6.4108 7.1723 4.2034 4.2249 4.3585 5.5673 3.5827 2.9304 3.6799 3.9063 4.5098 5.5226 2.4168 1.3801 4.5097 1.7112 1.5272 1.5119 3.3623 1.8634 2.0202 4.0979 2.5761 1.3462 4.0369 1.3884 2.6987 1.2704 2.4725 2.5975 1.6607 2.0945 2.0205 2.0391 1.3970 1.3519 1.6653 1.3166 1.8139 1.4753 2.1641 1.9974 2.1175 2.6975 1.3573 1.6890 2.5539 4.8022 1.4310 1.2794 1.2875 3.9994 3.6826 5.0759 5.3046 1.0731 1.0676 1.0591 1.0617 1.0794 3.5062 3.3273 6.9115 7.5879 7.3146 7.0667 7.7581 6.3845 1.0372 1.0395 1.0650 1.0968 1.0959 1.0983 1.0927 1.0939 1.0937 1.0888 1.0911 1.0918 1.0958 1.0938 1.0974 1.0660 1.0659 1.0661
irintensity: 0.7087 0.4009 0.7671 0.4302 0.1339 0.0629 1.8846 0.1239 1.1267 1.0863 0.3011 0.0187 2.3125 0.0141 5.5202 13.9660 3.3821 58.7647 120.6877 17.4457 92.5453 84.1015 3.6703 7.3556 9.6061 6.2830 5.2686 1.9078 18.7206 2.4054 1.4666 7.1412 2.1440 13.0166 0.3639 15.1468 1.6928 19.4154 7.4204 2.8161 1.9929 6.4548 4.2284 4.9740 11.2257 10.1951 0.0596 84.4055 60.8856 8.5992 17.0822 44.5632 30.0305 2.3010 2.5603 88.1953 1.4144 108.8127 4.7895 118.3222 3.8732 4.5061 227.8080 41.7021 115.8236 20.1560 72.0272 49.1988 1.6783 26.4472 5.3059 52.2693 9.6333 19.7135 76.2286 71.3061 30.4501 32.8415 1.8044 6.9423 24.4720 16.1342 89.2734 79.7691 84.1526 6.2806 2.6316 0.7789 20.4469 24.9719 9.1860 14.8345 76.8475 51.6331 23.9742 37.9717 75.8603 81.3359 4.4696 44.4735 78.8933 22.6135 10.3883 50.3498 29.4995 6.5253 9.1943 37.1103 21.7092 10.6433 1.6983 15.4058 1.5598 9.0961 58.5364 20.8880 67.7559
temp: 298.150 k
press: 1.00000 atm
elementType: 8 8 8 8 6 6 6 6 6 6 6 6 6 6 6 6 6 6 6 6 6 6 6 1 1 1 1 1 1 1 1 1 1 1 1 1 1 1 1 1 1
symmnumber: 1
zpe: 839479.6 jmol-1
zpe.correction: 0.319741 hartree
zpe.thermalcorrener: 0.341518 hartree
zpe.thermalcorrenthalpy: 0.342462 hartree
zpe.thermalcorrgfe: 0.267743 hartree
zpe.sumelectzpe: -1034.051365 hartree
zpe.sumelectthermal: -1034.029588 hartree
zpe.sumelectthermalent: -1034.028644 hartree
zpe.sumelectthermalfe: -1034.103364 hartree
dipole: 3.2059 1.9316 0.8925
dipole: 3.8478
quadrupole: -116.9184 -116.9506 -139.5462
quadrupole: 11.8736 2.7014 4.1878
quadrupole: 7.5533 7.5211 -15.0745 11.8736 2.7014 4.1878
hfenergy: -1034.3711064 hartree
pointgroup: C01 [X(C19H18O4)]
dipole: 1.2635451 0.7061245 0.4433106 debye
polarizability: 444.5825733|1.9130822|218.3096236|16.3292264|22.500114|126.9860507 unknown
InChI: InChI=1S/C19H18O4/c1-11(2)3-6-15-16(21)7-13(8-17(15)22)18-9-12-4-5-14(20)10-19(12)23-18/h3-5,7-10,20-22H,6H2,1-2H3
charge 0 multiplicity 1
41 atoms
O  2.175311 -0.739674 -0.33828
O  -2.679328 -1.824577 -1.405808
O  -2.918585 2.769068 -0.048319
O  6.902096 -1.913948 0.026274
C  0.046611 0.486824 -0.285823
C  -2.798727 0.474387 -0.726139
C  1.489925 0.491251 -0.064981
C  -4.306561 0.467259 -0.93107
C  3.711513 0.842288 0.381616
C  -2.002347 -0.675922 -0.949521
C  -2.115349 1.63136 -0.270124
C  -0.606077 -0.687317 -0.740805
C  -0.722201 1.657696 -0.050959
C  3.532743 -0.505093 -0.058996
C  2.396105 1.450204 0.367417
C  -5.058715 0.29218 0.384087
C  5.020589 1.270878 0.714007
C  4.563621 -1.440639 -0.187829
C  -5.820137 -0.771845 0.768859
C  5.856121 -0.980789 0.151796
C  6.085764 0.355416 0.596836
C  -6.526228 -0.770101 2.116856
C  -6.045636 -2.021698 -0.065162
H  -4.601108 1.43789 -1.373379
H  -4.568547 -0.327132 -1.646844
H  -0.013744 -1.59039 -0.92465
H  -0.236395 2.576337 0.299725
H  2.155869 2.474323 0.646255
H  -4.953924 1.138185 1.07884
H  5.21042 2.292831 1.056665
H  4.404168 -2.466092 -0.526554
H  7.105964 0.671225 0.850666
H  -6.361787 0.172955 2.666926
H  -7.619146 -0.909841 1.993033
H  -6.171041 -1.606567 2.752061
H  -5.370291 -2.083775 -0.932837
H  -5.882813 -2.927265 0.552235
H  -7.092535 -2.070397 -0.427877
H  -2.044305 -2.572135 -1.532207
H  -2.364501 3.5364 0.238128
H  7.766709 -1.508861 0.284179
