program: Gaussian 09
title: 000155225
version: EM64L-G09RevD.01
frameworkgroup: C1[X(C20H32O3)]
method: RPBEPBE
basis: SDD
operation: Freq
keyword: #pfreq=noraman
keyword: PBEPBE/SDD
title: #p freq=noraman PBEPBE/SDD
converged: YES YES NO NO
title: Mulliken charges:
elementType: O O O C C C C C C C C C C C C C C C C C C C C H H H H H H H H H H H H H H H H H H H H H H H H H H H H H H H H
charge: -0.452484 -0.435916 -0.266080 -0.385505 -0.384421 -0.382844 -0.387961 -0.375758 -0.371168 -0.377506 -0.380475 -0.365230 -0.470994 -0.342353 -0.162443 -0.241573 -0.197306 -0.228183 -0.195468 -0.216533 -0.137671 -0.330590 0.153248 0.194919 0.194584 0.194244 0.193865 0.192506 0.192818 0.196907 0.194805 0.195192 0.195086 0.191917 0.196255 0.189172 0.189038 0.214304 0.198547 0.213746 0.213746 0.207493 0.211436 0.187047 0.186989 0.224715 0.340432 0.231132 0.224677 0.228233 0.227932 0.230225 0.257729 0.252328 0.373196
chargesum: 0.00000
title: Mulliken charges with hydrogens summed into heavy atoms:
elementType: O O O C C C C C C C C C C C C C C C C C C C C
charge: -0.112052 -0.062720 -0.266080 0.003998 0.003688 0.002480 0.003751 0.014520 0.017003 0.000703 0.032376 0.062261 -0.052065 0.031682 0.062272 -0.010441 0.027372 0.000050 0.032464 0.013692 0.120058 -0.078262 0.153248
polarizability: 6.51100595e+02 9.45487993e+01 1.73361278e+02 2.60179249e+01 3.38145906e+00 1.90114216e+02
1716.lowfreq: -17.0576 -2.5991 -0.0020 0.0003 0.0015 2.1701 7.4857 10.5018 18.7553
frequency: -10.5634 7.6129 18.3052 25.6857 29.3612 36.6893 47.9363 53.0007 55.2219 80.1827 87.5260 89.3261 101.8447 109.0448 120.4218 126.2275 134.6666 138.9353 147.9265 150.5884 164.9510 197.9570 219.3283 220.0715 242.7632 263.0762 275.4133 297.9974 312.5699 332.9336 353.2234 390.7156 401.2739 433.0342 457.7255 464.8413 499.4913 504.0871 561.7756 570.7684 574.0053 621.9019 687.4713 717.7957 721.8251 731.0805 748.9881 774.8956 801.7652 820.8797 847.3282 862.0744 888.9049 912.3754 915.7282 919.4108 922.7714 954.6248 958.0771 966.5442 973.1036 988.9465 996.6038 997.5957 1012.9160 1026.8141 1027.8236 1035.2861 1041.9628 1052.2792 1060.2800 1075.0339 1080.1778 1081.4756 1093.8316 1116.6507 1148.1032 1157.1850 1174.8651 1186.1709 1191.3263 1201.3347 1204.1688 1214.4312 1216.2685 1231.2320 1238.6896 1245.0415 1257.6156 1262.2053 1266.3981 1274.9932 1277.0618 1278.6152 1282.6570 1284.7704 1286.9677 1289.4360 1292.3591 1295.0491 1296.3259 1303.0665 1307.0709 1320.8438 1332.4010 1344.1723 1352.9932 1355.4669 1359.4739 1372.0159 1413.4981 1454.1929 1459.4316 1459.8502 1462.8305 1464.3171 1467.7817 1471.0238 1476.8389 1482.0990 1486.5612 1490.3385 1568.1731 1589.5841 1630.0361 1633.4040 1652.0311 2924.8152 2946.5940 2948.7193 2949.1126 2951.1263 2952.0052 2954.0060 2959.6900 2964.6925 2970.1387 2971.9094 2982.3395 2986.1198 2990.5270 2991.0969 2998.3844 3008.7481 3015.8314 3027.0227 3037.9813 3046.4304 3057.6975 3071.3029 3079.9811 3082.6532 3089.2895 3093.5391 3099.3223 3106.9176 3156.5439 3527.6057 3564.4048
redmass: 1.9840 5.5521 4.5126 4.0259 5.2866 4.8536 3.2031 2.2362 4.1230 2.7486 3.0669 2.3724 5.2585 2.6091 2.6038 2.0028 3.9228 2.6801 2.0725 2.0655 3.6551 4.1122 4.3839 3.5988 2.5066 3.2377 1.0858 3.2967 4.2864 2.9064 3.0162 3.1075 3.7298 3.2560 3.8178 3.6718 3.0769 3.4043 3.5170 3.2300 1.2040 4.2993 3.8183 1.0601 1.0730 1.0959 1.1242 1.1658 1.3020 1.3501 1.5826 1.3512 1.8019 1.5177 1.3705 1.4949 5.8943 1.1591 6.4131 1.3532 4.7361 3.5770 1.7162 1.7069 1.4197 2.0067 1.1606 2.5285 2.0999 2.2332 2.4167 2.3405 2.0931 2.1749 3.5901 2.1354 1.3823 1.8816 1.8936 1.4393 1.3626 1.8617 1.5281 1.3263 1.4470 1.3502 1.3403 1.3253 1.3484 1.3690 1.4118 1.0345 1.1996 1.4102 1.2306 1.3614 1.1424 1.2801 1.1342 1.1270 1.2724 1.2905 1.4240 1.5330 1.4811 1.4919 1.6410 1.6548 1.6348 1.8620 1.4416 1.0919 1.0744 1.0748 1.0630 1.0809 1.0751 1.0935 1.0955 1.0965 1.0988 1.0968 5.4491 5.0983 5.9919 6.4590 5.7074 1.0544 1.0624 1.0588 1.0587 1.0589 1.0592 1.0595 1.0594 1.0587 1.0603 1.1065 1.0962 1.0973 1.0591 1.0991 1.1011 1.0998 1.1012 1.1046 1.1047 1.1040 1.1048 1.0920 1.0914 1.0919 1.0915 1.0902 1.0880 1.0880 1.0918 1.0640 1.0664
irintensity: 1.8975 0.0076 0.1010 0.2304 0.4021 0.0837 2.5367 2.1061 0.2563 0.8364 0.0364 2.7548 0.7844 1.8685 0.3509 1.8718 0.5062 0.0612 1.4285 0.0829 0.8893 1.7795 0.2673 0.8527 1.0904 1.9149 157.4379 5.3705 1.4261 1.8449 0.5565 6.2061 19.6624 1.8311 2.1945 20.4341 3.3067 20.4660 10.1777 6.8346 129.4005 7.0684 41.6003 16.1284 0.2582 8.4595 1.2696 6.2444 1.6412 4.7794 3.0668 4.4710 9.9251 4.7049 1.9048 4.7647 40.4728 0.9232 49.9060 4.7211 17.9283 8.6942 11.5206 27.1821 20.4097 15.4912 193.9741 20.4628 960.8715 0.1911 14.3698 0.3860 0.1330 0.0208 2.9907 2.6339 0.8502 3.0791 3.3427 20.0553 17.0918 18.2464 9.9985 15.6974 23.0428 46.0445 6.8378 2.9314 6.5856 20.0533 24.4007 0.6954 0.4064 1.8238 1.2566 0.7934 1.1469 0.5029 0.9971 0.1650 6.4459 0.8322 15.1228 33.6994 33.8173 1.4382 0.2230 0.0782 0.5244 111.0820 6.3386 6.8178 0.2580 0.7401 1.4603 0.5012 0.8239 0.1728 3.1378 1.1895 15.9282 21.2238 22.7632 1184.7934 107.9074 161.6993 12.7923 60.9659 25.1042 0.5806 2.4558 2.2588 10.7093 7.3776 1.1688 140.5477 127.5052 52.3952 0.6557 0.8451 48.2442 2.3046 1.3017 5.0245 3.1393 1.1013 50.2087 180.5926 134.0085 21.5477 3.2202 1.9521 8.9051 8.7877 55.3994 36.5289 7.6222 75.3514 2.0904
temp: 298.150 k
press: 1.00000 atm
elementType: 8 8 8 6 6 6 6 6 6 6 6 6 6 6 6 6 6 6 6 6 6 6 6 1 1 1 1 1 1 1 1 1 1 1 1 1 1 1 1 1 1 1 1 1 1 1 1 1 1 1 1 1 1 1 1
symmnumber: 1
zpe: 1244134.5 jmol-1
zpe.correction: 0.473866 hartree
zpe.thermalcorrener: 0.501469 hartree
zpe.thermalcorrenthalpy: 0.502413 hartree
zpe.thermalcorrgfe: 0.409710 hartree
zpe.sumelectzpe: -1005.141339 hartree
zpe.sumelectthermal: -1005.113736 hartree
zpe.sumelectthermalent: -1005.112792 hartree
zpe.sumelectthermalfe: -1005.205496 hartree
dipole: 5.4103 2.4655 -2.4466
dipole: 6.4293
quadrupole: -190.1742 -149.5812 -140.7810
quadrupole: 11.7020 -4.0117 4.8986
quadrupole: -29.9954 10.5976 19.3978 11.7020 -4.0117 4.8986
hfenergy: -1005.6152051 hartree
pointgroup: C01 [X(C20H32O3)]
dipole: -2.1301892 -0.8828631 -1.0397837 debye
polarizability: 651.5523707|95.2772506|173.5899372|-17.9969125|-4.6268046|189.4337812 unknown
InChI: InChI=1S/C20H32O3/c21-19-17-15-13-11-9-7-5-3-1-2-4-6-8-10-12-14-16-18-20(22)23/h4,6,8,10,12,14,16,18,21-22H,1-3,5,7,9,11,13,15,17,19H2
charge 0 multiplicity 1
55 atoms
O  -13.372357 1.675784 0.347823
O  12.190199 1.471606 -0.688363
O  11.326732 1.056008 1.436429
C  -5.974905 0.059928 0.324472
C  -4.820717 -0.752633 -0.304532
C  -7.34415 -0.206897 -0.340538
C  -3.445604 -0.460688 0.337699
C  -8.502597 0.583981 0.307545
C  -2.300511 -1.30637 -0.263667
C  -9.869131 0.331211 -0.368807
C  -0.91851 -0.978863 0.344661
C  -11.021296 1.117793 0.296039
C  0.217267 -1.866036 -0.240008
C  -12.372941 0.870855 -0.378418
C  1.566867 -1.563424 0.359624
C  2.680466 -1.183198 -0.347486
C  3.964164 -0.883469 0.25645
C  5.09269 -0.509714 -0.451109
C  6.362479 -0.21191 0.162743
C  7.502106 0.161699 -0.531577
C  8.75784 0.455248 0.112542
C  9.908788 0.828571 -0.547764
C  11.144466 1.109162 0.190232
H  -5.740301 1.142916 0.25736
H  -6.041163 -0.17653 1.407168
H  -4.769612 -0.535403 -1.392106
H  -5.045204 -1.836242 -0.214766
H  -7.56973 -1.292961 -0.291844
H  -7.283017 0.049484 -1.419085
H  -3.207779 0.617047 0.219434
H  -3.504019 -0.647593 1.430431
H  -8.272142 1.669106 0.270985
H  -8.572087 0.317414 1.382758
H  -2.522623 -2.383837 -0.113378
H  -2.263974 -1.146873 -1.361615
H  -9.799834 0.606953 -1.442251
H  -10.09391 -0.75587 -0.339514
H  -0.674955 0.087468 0.167058
H  -0.95738 -1.113615 1.445361
H  -10.806193 2.203644 0.264858
H  -11.104681 0.83744 1.364075
H  -0.046521 -2.928209 -0.044387
H  0.254675 -1.745417 -1.34033
H  -12.325373 1.173028 -1.448141
H  -12.629497 -0.2108 -0.332751
H  1.642789 -1.647103 1.456499
H  -14.264395 1.540629 -0.060691
H  2.608921 -1.096401 -1.442492
H  4.032547 -0.962306 1.352842
H  5.029115 -0.431814 -1.546973
H  6.42124 -0.288632 1.259722
H  7.456669 0.241287 -1.627745
H  8.808061 0.378122 1.209125
H  9.945427 0.929141 -1.637376
H  13.004901 1.651682 -0.146219
