program: Gaussian 09
title: 000155217
version: EM64L-G09RevD.01
frameworkgroup: C1[X(C19H23NO4)]
method: RPBEPBE
basis: SDD
operation: Freq
keyword: #p
keyword: freq=noraman
keyword: PBEPBE/SDD
title: #p freq=noraman PBEPBE/SDD
converged: YES YES NO NO
title: Mulliken charges:
elementType: O O O O N C C C C C C C C C C C C C C C C C C C H H H H H H H H H H H H H H H H H H H H H H H
charge: -0.309908 -0.261574 -0.238607 -0.255049 -0.079644 -0.174713 -0.130366 -0.241395 -0.505168 -0.487614 -0.495388 -0.017803 -0.438565 0.193489 -0.047225 0.208460 -0.582548 -0.506844 0.206037 -0.339239 -0.342350 -0.223753 -0.220531 -0.223554 0.268399 0.231248 0.288159 0.256786 0.228317 0.229473 0.231628 0.238150 0.226921 0.274212 0.220746 0.192916 0.236972 0.218137 0.218533 0.233758 0.239585 0.245191 0.269670 0.270491 0.232717 0.230330 0.231510
chargesum: 0.00000
title: Mulliken charges with hydrogens summed into heavy atoms:
elementType: O O O O N C C C C C C C C C C C C C C C C C C C
charge: -0.309908 -0.261574 -0.238607 -0.255049 -0.079644 0.093686 0.100882 0.046764 -0.020065 -0.026513 -0.030317 0.256409 -0.024903 0.193489 0.189747 0.208460 -0.145878 0.211691 0.206037 -0.069569 -0.071859 0.008965 0.009800 0.007956
polarizability: 2.88026555e+02 2.28716565e+00 1.96814851e+02 -3.40333585e+00 2.83557384e+01 1.74936619e+02
1716.lowfreq: -5.1608 -2.0783 -0.0006 -0.0004 0.0007 4.6489 21.0564 28.2359 31.6776
frequency: 20.9488 28.2198 31.6379 37.5654 57.8514 65.9486 69.9020 87.1599 93.8467 106.1517 118.3496 143.5947 155.4410 175.4905 188.7243 215.2943 226.6110 246.7187 274.7460 288.0139 309.0190 331.0807 367.0215 386.3125 404.3307 420.7448 429.3240 451.2379 466.1038 489.2512 511.9428 595.2151 609.2308 614.1472 666.6982 673.0346 680.0427 701.8667 704.1675 738.6483 758.1408 780.9158 795.4904 804.3968 810.8464 844.2605 851.8660 858.9079 865.0663 909.7712 920.3324 943.5312 945.5056 954.1801 954.3900 969.8380 982.7186 990.5373 995.8722 996.7143 1007.9158 1010.8425 1019.6998 1029.8153 1041.8603 1051.6507 1060.3795 1084.2825 1087.0297 1093.3169 1113.5710 1124.2119 1138.9655 1149.2154 1153.3707 1162.5379 1173.4307 1181.5488 1186.0585 1208.8257 1220.7185 1233.1280 1241.8909 1244.9260 1265.4384 1274.3710 1279.3842 1287.8363 1299.0933 1307.3215 1314.7172 1317.9581 1329.9989 1358.4238 1359.0979 1372.5379 1389.4903 1422.1509 1429.1776 1437.9411 1451.9886 1459.5540 1463.2443 1464.0087 1475.2286 1477.4876 1491.3137 1583.8218 1611.2121 1618.6139 1633.0840 1658.8726 2888.6641 2992.8719 3004.9284 3006.4720 3012.1172 3019.5639 3038.2350 3046.0366 3060.6234 3062.6699 3068.9992 3079.8108 3085.5186 3086.1630 3106.8885 3107.3799 3128.9938 3142.0438 3150.4663 3154.6519 3166.8695 3178.8924 3196.3436
redmass: 5.0843 4.8414 4.2386 4.8852 4.1320 5.4517 3.6436 3.2481 1.3528 2.7827 3.1000 3.6677 4.6194 2.6663 3.7828 4.9100 3.6331 3.4825 5.0642 2.9845 3.1972 5.5250 2.9807 3.8597 2.8306 3.2941 3.2170 3.9136 3.4483 4.1316 3.4973 3.9895 1.7165 6.3679 6.2622 4.5198 5.0755 1.7593 3.9893 4.0239 4.7900 2.4746 2.2113 3.9598 2.9234 2.9979 2.1809 3.6331 1.2469 2.9537 1.8431 1.8082 3.2595 1.5253 1.4287 3.4313 2.3974 6.2508 1.4412 2.4450 1.3275 1.1910 2.9075 1.9648 2.1257 2.7310 2.5859 2.4720 1.8178 2.9918 1.2707 2.2242 1.6204 1.4474 2.2789 1.6246 1.0571 1.1464 1.4337 1.4171 1.2376 1.4019 1.3641 3.3587 1.3361 1.2797 1.4304 1.3444 1.5224 1.3484 1.3232 1.3804 1.3670 1.4693 1.4176 1.4843 10.0716 1.1950 1.2021 2.2458 1.0500 1.0889 1.0848 1.0515 1.0785 2.2909 1.0902 6.9388 6.2324 9.8562 9.0741 4.6858 1.0673 1.0897 1.0295 1.0603 1.0603 1.0632 1.0850 1.0868 1.0929 1.0964 1.0875 1.1031 1.1020 1.0615 1.1045 1.0943 1.0855 1.0892 1.1048 1.0940 1.0980 1.0974 1.1140
irintensity: 0.5204 0.7364 0.2450 1.9357 1.0575 0.8339 1.2696 0.9977 0.3197 0.0105 0.1722 0.1364 0.1323 1.9064 3.3419 4.3843 6.9272 2.0502 3.8354 7.0565 9.8432 7.6096 0.8150 2.4693 0.0039 5.7588 4.8991 1.2220 15.5715 3.2439 1.4643 5.1765 16.5720 0.7547 4.9241 5.9303 12.8098 69.1424 23.8982 2.1764 3.5126 9.5138 21.3367 15.2058 2.2754 4.6546 7.9496 4.6789 0.1116 4.2607 1.2110 24.0594 40.2226 45.8000 12.6378 20.6846 8.2025 2.0291 4.6856 42.3583 0.2862 14.9462 142.1592 58.4763 39.1653 150.2866 103.3316 20.0764 25.3849 49.0871 0.4875 190.7077 11.2747 11.1039 24.4292 11.3983 0.3126 63.2226 7.2116 9.4373 40.1722 36.6311 8.6956 384.8148 1.3622 4.3910 16.0417 6.9922 45.1697 0.5647 4.9255 13.9331 14.1277 1.6783 8.9046 17.4550 2.7300 21.7189 14.6928 16.2109 13.3351 6.5776 4.3652 11.8460 4.5297 4.9246 30.3099 39.4971 10.4155 107.9589 161.3267 8.5524 71.6277 20.8289 33.0178 17.1801 8.8829 43.0009 5.1078 54.7076 10.5840 5.5173 3.9339 16.5465 37.7497 18.5732 24.9055 8.1194 0.2743 11.7878 15.0046 17.5734 23.4376 8.1892 25.8146
temp: 298.150 k
press: 1.00000 atm
elementType: 8 8 8 8 7 6 6 6 6 6 6 6 6 6 6 6 6 6 6 6 6 6 6 6 1 1 1 1 1 1 1 1 1 1 1 1 1 1 1 1 1 1 1 1 1 1 1
symmnumber: 1
zpe: 1009365.2 jmol-1
zpe.correction: 0.384447 hartree
zpe.thermalcorrener: 0.407409 hartree
zpe.thermalcorrenthalpy: 0.408354 hartree
zpe.thermalcorrgfe: 0.329510 hartree
zpe.sumelectzpe: -1091.657240 hartree
zpe.sumelectthermal: -1091.634278 hartree
zpe.sumelectthermalent: -1091.633333 hartree
zpe.sumelectthermalfe: -1091.712177 hartree
dipole: 1.1738 1.4544 1.8888
dipole: 2.6572
quadrupole: -118.9459 -129.6761 -148.1555
quadrupole: -4.5926 -8.4142 1.9361
quadrupole: 13.3133 2.5831 -15.8964 -4.5926 -8.4142 1.9361
hfenergy: -1092.0416871 hartree
pointgroup: C01 [X(C19H23N1O4)]
dipole: 0.4898542 -0.4662444 -0.7972384 debye
polarizability: 287.8683165|5.0852981|191.7011158|-0.2898192|29.9617692|180.2085934 unknown
InChI: InChI=1S/C19H23NO4/c1-3-11-20-14-9-10-15(20)17(19(22)23-2)16(12-14)24-18(21)13-7-5-4-6-8-13/h3-8,14-17H,1,9-12H2,2H3
charge 0 multiplicity 1
47 atoms
O  -1.102172 0.187163 -0.101281
O  1.171243 -2.899467 -0.228607
O  0.647528 -1.99614 1.851318
O  -2.134184 1.406634 1.601735
N  2.870294 1.213298 -0.631346
C  2.692716 -0.019029 0.197939
C  2.137579 2.23454 0.18861
C  1.218937 -0.50587 -0.045414
C  2.936836 0.436299 1.68112
C  2.576774 1.960792 1.672558
C  0.622897 1.987869 -0.024164
C  0.235854 0.57208 0.450053
C  4.294748 1.557698 -0.907748
C  0.963894 -1.833538 0.648844
C  4.912374 0.583233 -1.888602
C  -2.220877 0.66407 0.591247
C  6.103952 -0.040936 -1.714558
C  0.991403 -4.252883 0.353372
C  -3.498366 0.18642 -0.014729
C  -4.715482 0.598582 0.58782
C  -3.523182 -0.656104 -1.15667
C  -5.947861 0.170907 0.053595
C  -4.759256 -1.081151 -1.687961
C  -5.972092 -0.669511 -1.0854
H  3.390252 -0.804858 -0.135886
H  2.397416 3.251631 -0.152841
H  1.106602 -0.646201 -1.133184
H  2.323475 -0.140465 2.394542
H  3.99454 0.278401 1.956264
H  1.771476 2.206723 2.386679
H  3.453235 2.578191 1.93788
H  0.022658 2.73334 0.526814
H  0.40131 2.081466 -1.102724
H  0.150466 0.539193 1.551232
H  4.287868 2.569158 -1.362761
H  4.929765 1.617331 0.008806
H  4.319081 0.403527 -2.796909
H  6.707644 0.112217 -0.810676
H  6.513945 -0.717199 -2.472901
H  1.199064 -4.943811 -0.475395
H  1.694681 -4.40733 1.188923
H  -0.040449 -4.37147 0.724034
H  -4.669497 1.247508 1.468687
H  -2.578561 -0.967265 -1.61103
H  -6.886123 0.489063 0.520705
H  -4.779274 -1.731727 -2.569106
H  -6.93033 -1.001975 -1.500487
