program: Gaussian 09
title: 000155195
version: EM64L-G09RevD.01
frameworkgroup: C1[X(C9H10N2O3)]
method: RPBEPBE
basis: SDD
operation: Freq
keyword: #p
keyword: freq=noraman
keyword: PBEPBE/SDD
title: #p freq=noraman PBEPBE/SDD
converged: YES YES NO NO
title: Mulliken charges:
elementType: O O O N N C C C C C C C C C H H H H H H H H H H
charge: -0.406935 -0.238528 -0.289274 -0.471970 -0.661922 0.454417 -0.618778 0.475307 -0.340183 -0.412928 -0.442429 -0.340592 0.213245 0.265720 0.242577 0.243787 0.256194 0.233305 0.213013 0.308518 0.289614 0.375598 0.347503 0.304744
chargesum: 0.00000
title: Mulliken charges with hydrogens summed into heavy atoms:
elementType: O O O N N C C C C C C C C C
charge: -0.031338 -0.238528 -0.289274 -0.182356 -0.009675 0.454417 -0.132414 0.475307 -0.083989 -0.179623 -0.229417 -0.032074 0.213245 0.265720
polarizability: 1.88741176e+02 2.59616903e+00 1.20613653e+02 8.39245890e+00 2.12862659e+00 6.57529934e+01
1716.lowfreq: -7.8290 -0.0006 -0.0005 0.0003 3.5057 8.8147 24.6633 34.6676 47.7843
frequency: 24.2446 34.6343 47.7677 60.0739 94.1190 145.0147 169.1877 270.5892 280.1972 321.4018 355.7676 365.9628 403.7121 409.3749 489.6512 494.7142 520.9675 541.7496 589.5983 600.0733 632.8010 653.2683 700.4065 711.1690 727.2915 799.6200 820.8448 838.9198 844.2997 877.3331 929.8885 952.0346 973.5755 985.6802 1009.4833 1041.1710 1057.9660 1125.8086 1180.7115 1194.9674 1206.7258 1266.2221 1272.0726 1287.0355 1313.6923 1334.8179 1388.4080 1415.4036 1455.4884 1499.6737 1516.4181 1589.6083 1611.6648 1627.6382 1660.2330 1660.9999 3019.0021 3102.7305 3106.6028 3131.6469 3147.4873 3192.0536 3505.6711 3529.0788 3543.2623 3697.8133
redmass: 5.9548 7.9529 4.5361 5.0330 5.7099 5.2247 4.1497 2.7869 1.8652 4.0649 4.7739 4.8015 2.2530 2.9466 2.8187 1.2540 2.4719 3.4146 1.2167 2.6793 4.4201 2.0759 3.5943 9.5060 4.0693 3.5065 1.9291 2.6709 2.4955 2.3335 1.9458 1.4119 4.0751 1.3368 2.8271 1.9403 1.9324 1.3680 1.2051 1.1173 2.4736 1.9376 1.4797 2.5782 1.9520 1.7034 4.9328 3.4769 1.1007 2.2212 2.9303 3.3914 1.5225 5.1450 5.8862 4.5932 1.0622 1.1000 1.0891 1.0910 1.0953 1.0945 1.0638 1.0722 1.0496 1.1039
irintensity: 3.0880 6.0377 13.0131 3.8744 0.7749 5.9443 0.4394 12.4080 14.8765 3.2319 5.7856 4.2899 6.3924 0.3511 67.3524 286.7527 2.2728 44.4984 67.0152 38.8134 13.3352 109.2427 36.3078 27.0848 2.1985 15.9990 58.3940 3.3866 12.8953 21.1402 26.9730 6.2714 2.2587 7.7016 4.6469 35.7547 202.9017 44.8643 27.2438 3.6836 3.6788 63.0450 7.1551 59.8511 24.6872 233.6198 123.3217 65.4902 13.7508 97.3200 653.9814 82.7916 29.0196 13.3360 400.5000 90.3358 16.1412 6.1565 21.9734 14.1496 5.1076 6.3872 20.5349 12.2144 58.6473 42.6271
temp: 298.150 k
press: 1.00000 atm
elementType: 8 8 8 7 7 6 6 6 6 6 6 6 6 6 1 1 1 1 1 1 1 1 1 1
symmnumber: 1
zpe: 480644.5 jmol-1
zpe.correction: 0.183068 hartree
zpe.thermalcorrener: 0.196500 hartree
zpe.thermalcorrenthalpy: 0.197444 hartree
zpe.thermalcorrgfe: 0.140718 hartree
zpe.sumelectzpe: -683.147682 hartree
zpe.sumelectthermal: -683.134250 hartree
zpe.sumelectthermalent: -683.133306 hartree
zpe.sumelectthermalfe: -683.190032 hartree
dipole: 2.1503 2.9647 0.3294
dipole: 3.6772
quadrupole: -62.5069 -80.7540 -80.7991
quadrupole: 23.5275 2.9764 0.3262
quadrupole: 12.1797 -6.0673 -6.1124 23.5275 2.9764 0.3262
hfenergy: -683.3307498 hartree
pointgroup: C01 [X(C9H10N2O3)]
dipole: 0.8843826 1.0343363 0.4909165 debye
dipolederiv: -0.6258881 -0.3254072 0.0065329 -0.4416293 -0.9880302 0.2040561 0.1825506 0.2984164 -0.3403691 -0.5741401 0.1289337 0.1730015 0.0309308 -0.8356068 -0.0555908 0.3322519 -0.265648 -0.5653315 -0.7732737 0.0197831 -0.0584382 0.2421838 -0.952251 -0.1849605 0.0147513 -0.2156631 -0.4672884 -2.0259166 0.2702229 -0.1708023 0.6551502 -0.4289733 0.0836551 -0.0734722 0.0229484 -0.3532752 -1.5217191 -0.2287167 -0.2083033 -0.3398939 -0.3829538 0.0940491 -0.274833 0.113525 -0.7931605 0.2773211 0.029764 -0.0259724 0.0435377 -0.1063946 -0.0419563 0.1470029 -0.0215143 -0.1414607 -0.2746189 -0.0120204 0.1975571 0.0541951 0.0793132 0.0154689 0.1697601 -0.0000388 -0.0325171 1.4924207 -0.0369621 0.2203871 0.2112762 0.0081104 0.0019844 0.3524929 -0.0442155 0.1451078 0.0331176 0.008881 0.043631 -0.076874 0.0384079 0.0574744 -0.0110708 0.0898837 -0.0980006 0.0396848 -0.0295185 0.0523278 -0.0010462 0.1010883 0.1082002 0.0581807 0.0788928 -0.0979575 -0.3670763 -0.0077178 -0.0151021 0.222658 0.0284819 0.1175946 0.0490416 0.0890245 -0.1654652 -0.334166 -0.0007977 -0.0175044 -0.2581495 -0.0537676 -0.0098482 -0.1398224 0.0398864 -0.1614806 0.8160868 0.1768063 -0.4644103 0.3146053 1.4536875 -0.0625542 -0.8891026 0.029368 0.7672707 2.5898686 -0.0736343 0.3709196 -0.7143878 1.3278661 0.2677073 0.1768335 0.3652705 0.5189076 0.066052 0.0019754 0.0029627 -0.0656078 -0.0285937 -0.0965016 -0.0016603 -0.0566946 0.0449118 -0.0076857 0.0244916 -0.0367381 0.0795113 -0.0047658 0.093538 -0.0419331 0.0417968 0.0357609 0.0406211 0.0927225 -0.0007035 0.0903582 0.0217619 -0.0329891 0.0138679 -0.0406716 0.1284419 0.0473455 -0.0707301 -0.0528279 -0.0741379 -0.0303739 -0.0754927 -0.0422482 -0.075762 0.1031707 0.0084777 -0.0961064 -0.0596861 -0.0838131 -0.0427929 -0.0896269 -0.0657209 -0.0955149 0.1190373 0.1645126 0.0455064 0.0151211 0.0319474 0.077936 -0.030751 0.0024245 -0.030838 0.1724067 0.1218279 0.027159 -0.028433 0.0054425 0.0995599 -0.083545 -0.0382748 -0.0781533 0.2802712 0.3476362 0.0262472 0.1185964 0.0643874 0.2926464 -0.0933456 0.1467662 -0.0609397 0.174114 0.2537898 0.0064082 -0.0289263 -0.0224664 0.19686 -0.0828817 -0.0386627 -0.0783503 0.3652862 0.2057221 0.02271 -0.0331893 0.0318218 0.1287841 -0.1036846 -0.0291233 -0.1050085 0.3616198 unknown
polarizability: 188.5777189|-3.0198568|114.0697376|9.7287792|17.6952957|72.4603663 unknown
InChI: InChI=1S/C9H10N2O3/c10-9(14)11-7-3-1-6(2-4-7)5-8(12)13/h1-4,11-12H,5,10H2
charge 0 multiplicity 1
24 atoms
O  -4.274738 -1.113654 0.609762
O  -4.074537 1.180934 0.906979
O  3.616259 -1.499469 -0.316917
N  2.688752 0.588103 0.302872
N  4.976378 0.155154 0.589189
C  -1.456783 0.202252 -0.662863
C  -2.943109 0.089921 -1.008783
C  1.319323 0.405987 -0.03407
C  -0.92944 1.39601 -0.108195
C  -0.57446 -0.880842 -0.88713
C  0.438807 1.498311 0.201472
C  0.801054 -0.796069 -0.583738
C  -3.805041 0.155554 0.243076
C  3.740349 -0.332157 0.157217
H  -3.14463 -0.854173 -1.537712
H  -3.247855 0.932151 -1.656323
H  -1.596178 2.242407 0.091741
H  -0.964321 -1.815445 -1.307819
H  0.827964 2.432029 0.629243
H  1.474628 -1.635513 -0.764145
H  2.915675 1.503449 0.696373
H  -4.797721 -1.038905 1.454496
H  5.766309 -0.478992 0.501219
H  5.129515 1.081755 0.981158
