program: Gaussian 09
title: 000155192
version: EM64L-G09RevD.01
frameworkgroup: C1[X(C20H22O8)]
method: RPBEPBE
basis: SDD
operation: Freq
keyword: #pfreq=noraman
keyword: PBEPBE/SDD
title: #p freq=noraman PBEPBE/SDD
converged: YES YES NO NO
title: Mulliken charges:
elementType: O O O O O O O O C C C C C C C C C C C C C C C C C C C C H H H H H H H H H H H H H H H H H H H H H H
charge: -0.350658 -0.284131 -0.284698 -0.387318 -0.382161 -0.398592 -0.337853 -0.336896 -0.030704 0.290493 0.300932 0.163630 -0.025694 -0.027115 0.026868 0.045844 0.196306 0.066710 0.204599 -0.530730 -0.817128 0.190945 0.225899 -0.807468 -0.744132 -0.751883 -0.524975 -0.522090 0.281552 0.260033 0.248813 0.231222 0.263434 0.230701 0.239739 0.249715 0.267278 0.234229 0.275075 0.243686 0.244414 0.390018 0.387333 0.380385 0.220018 0.242118 0.242687 0.236823 0.226428 0.236300
chargesum: 0.00000
title: Mulliken charges with hydrogens summed into heavy atoms:
elementType: O O O O O O O O C C C C C C C C C C C C C C C C C C C C
charge: -0.350658 -0.284131 -0.284698 0.002700 0.005172 -0.018207 -0.337853 -0.336896 -0.030704 0.290493 0.300932 0.163630 -0.025694 -0.027115 0.026868 0.045844 0.196306 0.066710 0.204599 -0.249178 -0.077060 0.190945 0.225899 -0.073593 0.007089 0.011292 0.179847 0.177460
polarizability: 3.41499561e+02 1.32761427e+01 2.41716563e+02 -8.71786933e+00 1.82506052e+00 2.27526829e+02
1716.lowfreq: -6.6350 -5.5272 0.0005 0.0007 0.0010 2.8689 11.8983 17.2605 27.1103
frequency: 11.2692 17.2273 27.0818 48.8004 52.5975 56.2084 81.2088 88.2596 98.8132 122.9232 125.1578 130.2156 140.0990 144.1472 151.9881 153.6234 163.9621 168.3923 180.1072 180.4195 205.0861 228.5268 250.6421 259.6465 273.8156 284.4969 290.1458 300.6118 312.9874 322.1504 342.0136 345.9523 354.7288 366.6667 375.3651 383.4774 402.1319 424.8223 426.2815 453.2711 484.2877 521.5392 546.8125 561.9784 566.3285 579.8158 580.7860 586.7615 614.9844 616.9650 655.4946 664.1075 666.4680 687.8039 709.9748 715.3834 756.6990 784.3745 807.7042 831.3144 855.6970 887.5467 904.8407 931.3841 964.7465 978.8214 992.0397 1009.5530 1026.3995 1027.3790 1033.6454 1039.7418 1044.4122 1046.5307 1047.6495 1082.9704 1090.6943 1102.6863 1109.0939 1112.0420 1130.5441 1149.8415 1153.5786 1177.1565 1189.5650 1225.5141 1258.9191 1276.1123 1294.3518 1326.6109 1341.7146 1356.6410 1379.9661 1384.9050 1386.8514 1390.0684 1394.5122 1397.8915 1411.5077 1414.9731 1421.6697 1427.2648 1441.9271 1446.2100 1447.6993 1449.2781 1456.8152 1458.4424 1458.8394 1459.5033 1464.1953 1466.3394 1474.7853 1477.5804 1481.0568 1482.4519 1546.1983 1555.0500 1581.9573 1599.7977 1630.5357 1632.0019 2421.7907 2506.7831 2967.9254 2970.5063 2980.9736 2982.3988 2999.2922 2999.5802 3060.7750 3061.9930 3065.2573 3066.6059 3087.6206 3089.1346 3105.7529 3107.6945 3122.0270 3122.6918 3125.4243 3130.9844 3172.1183 3484.3384
redmass: 5.8724 5.4991 4.5971 3.4351 3.1995 3.1196 4.2495 3.6470 2.5501 3.8722 1.5615 1.3531 2.2215 4.3591 2.6101 6.2235 1.3790 1.1424 3.0503 1.1509 1.0244 4.6429 3.8211 3.7167 4.1261 4.4059 3.8425 3.2138 5.5560 6.2607 5.7427 5.8682 6.0919 4.5450 4.8258 5.6860 5.4522 6.5799 6.2274 6.7812 7.5321 6.8219 8.0615 4.0723 3.7285 1.2590 3.6489 6.6761 4.7218 4.1857 5.6198 4.9917 5.4096 5.0365 6.5578 4.3958 3.7698 6.1915 5.7490 4.7182 1.7574 6.7661 5.5770 4.5370 2.3015 2.3809 2.2769 1.7319 1.1294 1.7095 1.6132 3.6206 1.0850 1.4712 1.4684 3.0885 2.8535 5.1620 1.2759 1.2824 2.7431 1.4569 1.4632 4.3092 1.9968 1.8268 3.0986 4.2746 6.3157 4.0655 3.7175 4.6172 3.7124 1.4982 1.4901 3.4190 1.4412 1.3333 2.4495 3.0497 1.6770 1.1701 1.1924 1.2709 1.0986 1.1130 1.6302 1.2915 1.0754 1.0689 1.1192 1.5160 1.1570 1.2445 1.1630 1.0737 3.4706 4.1642 4.6891 4.9756 3.5538 4.1104 1.0776 1.0771 1.0320 1.0313 1.0406 1.0410 1.0360 1.0384 1.1027 1.1038 1.0917 1.0920 1.0960 1.0925 1.1005 1.1003 1.1019 1.1017 1.1021 1.1025 1.0919 1.0643
irintensity: 0.6505 0.2696 0.6083 2.2805 3.5403 3.6857 1.2291 1.8984 4.1217 0.8306 0.6257 0.6020 0.8548 0.6080 0.6354 1.3444 0.5196 1.1844 1.9606 0.8756 0.7202 10.2470 4.6485 6.0221 1.2456 3.5629 4.1794 10.0402 3.7833 7.4754 0.7759 21.1444 1.4232 1.0526 1.7245 7.1883 11.2707 4.7716 2.4145 3.6453 7.6341 1.6103 7.6590 3.6979 4.0280 121.9066 4.7832 24.4881 15.8150 3.4246 2.0967 8.9711 10.1989 1.2927 2.2783 24.3082 2.0027 4.6199 5.9650 5.8851 20.8224 9.7316 23.2535 36.3543 33.9302 9.7677 46.5064 19.5205 115.1723 11.9839 6.4904 314.4112 63.1427 13.4983 5.8840 118.4019 183.5407 82.0830 0.6424 1.4751 94.7001 5.4855 40.7575 91.7925 0.9388 209.1044 145.1725 106.8243 130.2099 253.6676 148.7818 173.8432 33.9333 103.1186 68.7452 45.5259 113.8048 7.2559 328.8287 147.7284 17.5890 18.6994 20.5633 48.1401 18.0033 16.8000 31.9275 10.7316 16.9951 18.0605 32.7390 73.2692 3.8916 4.8966 9.6409 10.9069 51.8864 166.0055 163.7677 102.5359 368.2456 333.3251 488.7419 431.7901 63.8324 60.5414 33.9562 29.5681 2.0607 3.4515 36.2083 37.1860 14.7064 11.2942 5.1197 10.4428 6.2368 6.3465 19.6923 24.7810 17.9035 11.6721 0.7448 99.3756
temp: 298.150 k
press: 1.00000 atm
elementType: 8 8 8 8 8 8 8 8 6 6 6 6 6 6 6 6 6 6 6 6 6 6 6 6 6 6 6 6 1 1 1 1 1 1 1 1 1 1 1 1 1 1 1 1 1 1 1 1 1 1
symmnumber: 1
zpe: 1001904.0 jmol-1
zpe.correction: 0.381605 hartree
zpe.thermalcorrener: 0.410701 hartree
zpe.thermalcorrenthalpy: 0.411645 hartree
zpe.thermalcorrgfe: 0.320373 hartree
zpe.sumelectzpe: -1375.031564 hartree
zpe.sumelectthermal: -1375.002468 hartree
zpe.sumelectthermalent: -1375.001524 hartree
zpe.sumelectthermalfe: -1375.092796 hartree
dipole: 6.4821 1.4059 -1.4546
dipole: 6.7904
quadrupole: -151.5513 -157.3231 -173.8564
quadrupole: -17.4530 0.1630 7.5236
quadrupole: 9.3589 3.5872 -12.9461 -17.4530 0.1630 7.5236
hfenergy: -1375.4131695 hartree
pointgroup: C01 [X(C20H22O8)]
dipole: -2.5292276 0.8590741 -0.047099 debye
polarizability: 340.2418713|-18.1490599|234.5544178|6.5970048|-8.109541|235.9466642 unknown
InChI: InChI=1S/C20H22O8/c1-8-12(26-5)7-13(14(10(3)21)16(8)23)28-20-17(24)9(2)19(27-6)15(11(4)22)18(20)25/h7,23-25H,1-6H3
charge 0 multiplicity 1
50 atoms
O  0.503048 -0.56926 1.264681
O  -4.669984 0.894914 -0.445737
O  2.863116 2.93904 -1.11621
O  -1.078075 1.065282 2.798697
O  -0.413372 -1.445448 -1.245201
O  5.278963 -1.002517 0.341725
O  -2.182258 -1.511739 -2.941712
O  4.047994 -2.873289 1.371076
C  -0.757654 -0.176028 0.743488
C  -2.891574 0.992702 1.203968
C  1.688395 -0.092832 0.622509
C  -2.573383 -0.288026 -0.929251
C  -3.368269 0.517494 -0.035534
C  2.862122 -0.901178 0.733146
C  -1.569246 0.618848 1.577885
C  -1.236278 -0.652761 -0.495345
C  4.137482 0.953008 -0.411175
C  4.095226 -0.321038 0.226449
C  2.91658 1.652766 -0.533777
C  1.697472 1.15458 -0.003611
C  -3.695926 1.905922 2.103805
C  -2.99373 -0.754683 -2.259257
C  2.898718 -2.276703 1.256613
C  5.463334 1.518263 -0.868139
C  -4.306817 -0.396933 -2.918935
C  1.663877 -3.069392 1.618878
C  -5.769821 0.165542 0.219736
C  3.027729 2.97629 -2.583807
H  0.7944 1.764177 -0.088125
H  -3.037533 2.660178 2.566058
H  -4.481965 2.421261 1.528574
H  -4.171471 1.352695 2.93656
H  6.259054 1.220612 -0.165632
H  5.760366 1.123811 -1.859216
H  5.418863 2.618568 -0.92534
H  -4.260685 -0.723634 -3.969555
H  -4.517859 0.68144 -2.846655
H  -5.148878 -0.91303 -2.421854
H  0.920624 -3.031798 0.803591
H  1.169069 -2.648111 2.511094
H  1.968663 -4.108168 1.81942
H  -0.156377 0.708179 2.922702
H  -0.96752 -1.666889 -2.125465
H  5.050105 -1.914188 0.821448
H  -5.706231 -0.918715 0.004075
H  -6.697096 0.582034 -0.201728
H  -5.750879 0.323018 1.313437
H  2.99506 4.042253 -2.854895
H  2.197672 2.434041 -3.075683
H  3.992251 2.537342 -2.898575
