program: Gaussian 09
title: 000155180
version: EM64L-G09RevD.01
frameworkgroup: C1[X(C18H30N4O)]
method: RPBEPBE
basis: SDD
operation: Freq
keyword: #p
keyword: freq=noraman
keyword: PBEPBE/SDD
title: #p freq=noraman PBEPBE/SDD
converged: YES YES NO NO
title: Mulliken charges:
elementType: O N N N N C C C C C C C C C C C C C C C C C C H H H H H H H H H H H H H H H H H H H H H H H H H H H H H H
charge: -0.236767 -0.211913 -0.110406 -0.635370 -0.657981 -0.438953 -0.547052 -0.372177 0.415798 -0.537240 0.125330 -0.350057 -0.397240 -0.357005 -0.456546 -0.213663 -0.181676 -0.539153 0.210313 -0.168014 -0.160405 -0.437315 -0.669892 0.256057 0.218253 0.246216 0.247516 0.210663 0.221141 0.253233 0.252535 0.235618 0.171157 0.212742 0.182739 0.237156 0.180522 0.207932 0.225190 0.212122 0.202076 0.207986 0.221096 0.216207 0.206072 0.202306 0.291093 0.319401 0.308082 0.334064 0.224546 0.209459 0.214204
chargesum: 0.00000
title: Mulliken charges with hydrogens summed into heavy atoms:
elementType: O N N N N C C C C C C C C C C C C C C C C C C
charge: -0.236767 -0.211913 -0.110406 -0.024875 -0.015834 0.035357 -0.053321 0.059627 0.415798 -0.031473 0.125330 0.056717 -0.001759 -0.119850 -0.068092 0.011527 0.030445 -0.129092 0.210313 0.053082 0.055802 -0.028937 -0.021682
polarizability: 3.17177910e+02 -4.28430863e+01 2.71577085e+02 -2.48283572e+01 1.50086233e+01 1.78157999e+02
1716.lowfreq: -7.3139 -2.2722 -0.0008 -0.0005 0.0005 3.9624 8.8241 14.9487 22.0146
frequency: 7.5437 14.4113 21.9093 23.1178 26.0291 44.4619 52.4719 58.9248 63.4431 80.8433 97.5173 105.5027 114.8292 121.9512 130.8958 147.9400 174.1606 183.0330 193.0616 219.1302 240.2380 244.9433 259.9034 271.9898 304.5079 329.4524 346.4555 362.0546 383.6462 398.5360 404.7394 424.0201 428.5614 453.0048 475.7227 491.6368 498.3110 511.2207 551.6130 554.2715 569.3357 580.3399 657.4809 660.9221 676.3151 736.9235 750.4105 769.1517 770.1448 794.9432 804.7686 820.4080 838.6431 859.0815 870.7780 888.6399 909.1317 926.5910 949.4963 963.2908 972.4868 976.4869 1001.8094 1003.1634 1014.6949 1015.6792 1030.7167 1043.0178 1048.6996 1063.6875 1067.3108 1071.6076 1079.4667 1087.4306 1124.9694 1128.7802 1142.5754 1157.5539 1175.4590 1181.6869 1196.4695 1207.2857 1218.3630 1236.0472 1239.3673 1245.0861 1252.2527 1263.1673 1266.4508 1279.1187 1285.2328 1288.0294 1292.0632 1293.8702 1307.3586 1319.5658 1325.3229 1339.4016 1346.8865 1348.9753 1364.8145 1376.2999 1386.2241 1390.6686 1406.6005 1450.0205 1451.5934 1452.4900 1455.1458 1465.1868 1466.3893 1471.2208 1472.0445 1474.1776 1485.0440 1485.8684 1600.8150 1614.1275 1623.7885 1645.2454 1670.6909 1676.8170 1684.4746 2856.8257 2918.2994 2932.4576 2949.9619 2963.2766 2974.4004 2976.9169 2980.3155 2996.6560 3008.2957 3017.3117 3023.1881 3026.0303 3028.0334 3032.6835 3050.0699 3056.3030 3065.8653 3071.4064 3072.0465 3074.1020 3080.7472 3083.2524 3085.4638 3087.9856 3115.8456 3521.8394 3548.8040 3669.8834 3694.8464
redmass: 4.6065 3.9579 4.1677 4.2498 4.0929 3.9478 3.3801 2.1780 3.2973 3.0850 3.0409 1.9471 2.4719 2.5773 3.5286 4.0298 2.2620 2.5211 1.8283 2.1481 2.5971 3.2342 2.1682 2.5884 3.0478 2.7949 3.1764 1.4107 2.1016 2.1483 1.5846 1.1748 2.9876 2.0545 2.8906 3.1806 2.6808 3.0816 3.4196 2.3031 1.6938 2.6258 5.4060 4.7448 4.9754 1.1109 4.3308 1.3491 1.2716 1.5746 1.4492 1.3747 2.1475 1.6071 2.0449 1.9069 2.1701 1.9260 2.5563 1.1105 1.1812 1.8103 2.5067 2.5347 2.0552 2.4921 1.4414 2.8263 2.0392 2.4850 2.6586 3.8489 2.0999 2.4631 1.9540 1.9218 1.1788 1.6324 1.8551 2.1566 1.8886 1.2626 1.1065 1.4762 1.3115 1.5278 1.4214 1.3010 1.2942 1.1859 1.3227 1.1470 1.3051 1.3541 1.3511 1.3780 1.5221 1.4863 1.7575 1.5020 1.5700 1.4735 1.2125 2.6869 4.3178 1.0797 1.0835 1.0924 1.0897 1.0738 1.0750 1.0864 1.0948 1.0435 1.0629 1.1004 1.2253 1.2754 9.1726 6.9660 3.7055 7.7105 6.5638 1.0610 1.0946 1.0655 1.0650 1.0618 1.0618 1.0355 1.0605 1.0625 1.0601 1.0904 1.0968 1.0930 1.0625 1.1009 1.1023 1.1033 1.0939 1.1033 1.0952 1.0939 1.0919 1.0985 1.1023 1.0877 1.0890 1.0450 1.0454 1.1017 1.1026
irintensity: 0.4980 0.1072 0.8089 0.8523 2.6995 1.2796 0.4908 0.3909 0.7742 2.2512 1.4653 0.3669 1.4191 0.8627 4.8382 1.9359 0.7470 0.6858 0.2417 3.0215 8.2825 0.1865 0.5183 5.1036 13.2909 8.2419 2.2651 63.0846 37.9780 65.9626 108.7283 157.0024 2.7110 32.2631 2.7496 3.0585 5.1086 0.6472 11.2076 82.5609 131.1773 16.5972 33.2572 3.6053 81.8480 7.2165 0.9192 8.2001 5.6331 3.3045 3.3194 7.5661 0.7781 15.7671 7.0072 9.5225 19.5824 1.6361 13.3965 37.4671 67.6236 10.5267 9.2346 9.5129 2.8014 9.9186 7.8225 4.5450 29.6210 10.1897 1.6467 8.2758 1.6680 0.6189 22.1044 0.0680 0.1536 86.9149 9.7082 0.2390 40.4399 19.6382 0.4053 43.8152 18.3921 35.2042 12.8676 11.4414 26.8957 4.2354 5.7622 7.6092 12.8692 6.2511 3.3358 28.6589 21.8762 22.4685 88.8377 9.7743 13.6875 13.0708 6.9943 97.5054 120.8904 5.5795 12.4432 14.6715 20.0194 6.5737 11.7027 6.3487 2.5374 10.4228 10.0859 23.5084 131.9283 67.4151 627.0078 182.8551 576.7906 9.2782 1.1194 74.9407 60.2326 44.6153 26.0438 51.8402 42.7477 39.3697 31.2450 41.9452 11.5303 13.2539 14.9114 4.2074 22.2308 1.6300 54.2761 4.7473 2.0991 29.3176 17.8093 40.6626 55.4603 55.1901 14.9338 53.2055 38.1834 18.3377 15.7844 18.7892 18.4068
temp: 298.150 k
press: 1.00000 atm
elementType: 8 7 7 7 7 6 6 6 6 6 6 6 6 6 6 6 6 6 6 6 6 6 6 1 1 1 1 1 1 1 1 1 1 1 1 1 1 1 1 1 1 1 1 1 1 1 1 1 1 1 1 1 1
symmnumber: 1
zpe: 1196763.7 jmol-1
zpe.correction: 0.455823 hartree
zpe.thermalcorrener: 0.482932 hartree
zpe.thermalcorrenthalpy: 0.483876 hartree
zpe.thermalcorrgfe: 0.392139 hartree
zpe.sumelectzpe: -996.330191 hartree
zpe.sumelectthermal: -996.303082 hartree
zpe.sumelectthermalent: -996.302138 hartree
zpe.sumelectthermalfe: -996.393874 hartree
dipole: -0.2460 -4.3154 -0.2067
dipole: 4.3274
quadrupole: -108.4023 -134.3382 -142.2408
quadrupole: 31.9510 -7.1738 -7.8108
quadrupole: 19.9248 -6.0111 -13.9137 31.9510 -7.1738 -7.8108
hfenergy: -996.7860138 hartree
pointgroup: C01 [X(C18H30N4O1)]
dipole: 0.1145421 -1.6928656 0.1402539 debye
polarizability: 317.081371|42.8721327|271.4844927|-23.4684207|-17.6208262|178.3471306 unknown
InChI: InChI=1S/C18H30N4O/c1-2-3-4-5-6-8-11-16-12-13-17(23)22(16)15-10-7-9-14-21-18(19)20/h3-4,6,8,11H,2,5,7,9-10,12-15,19-20H2,1H3
charge 0 multiplicity 1
53 atoms
O  1.374378 4.082973 -1.025468
N  0.152173 2.152646 -0.419644
N  6.004621 -1.063545 0.241645
N  7.73812 -1.169449 -1.342572
N  7.150878 -3.155964 -0.236003
C  1.239607 1.202309 -0.709702
C  -1.930596 3.08315 0.268629
C  1.998823 0.741442 0.55641
C  -1.127478 1.794992 0.068268
C  -0.987422 4.225684 -0.1939
C  0.321309 3.538179 -0.598354
C  3.087948 -0.30037 0.223017
C  3.884364 -0.751258 1.46453
C  -1.553507 0.511425 0.304343
C  5.020871 -1.736007 1.114345
C  -2.88548 0.177347 0.790665
C  -3.331569 -1.095801 1.024828
C  -4.722004 -1.449867 1.519886
C  6.906606 -1.779047 -0.387479
C  -5.493858 -2.306244 0.524235
C  -6.699166 -1.98159 -0.011017
C  -7.465419 -2.819932 -1.014631
C  -7.729588 -2.060828 -2.341294
H  1.938119 1.722245 -1.389732
H  0.816849 0.332103 -1.247956
H  -2.220638 3.195318 1.328455
H  -2.863829 3.054799 -0.320441
H  1.283105 0.320188 1.2900
H  2.464204 1.626807 1.031317
H  -1.378059 4.785386 -1.061395
H  -0.775828 4.964694 0.597667
H  3.805555 0.116539 -0.50995
H  2.621073 -1.188984 -0.254829
H  4.334878 0.13474 1.952717
H  3.203338 -1.22621 2.201077
H  -0.86801 -0.326213 0.121922
H  4.576155 -2.644464 0.634612
H  5.496404 -2.073237 2.064899
H  -3.578588 1.01091 0.980152
H  -2.653177 -1.942174 0.830689
H  -5.293186 -0.527829 1.740621
H  -4.63457 -2.009631 2.477553
H  -5.012989 -3.25081 0.223213
H  -7.170883 -1.028872 0.281562
H  -6.908395 -3.753968 -1.222237
H  -8.441045 -3.121479 -0.579354
H  8.70706 -1.474967 -1.425486
H  7.542457 -0.182118 -1.502325
H  7.579039 -3.687413 -0.99092
H  6.657945 -3.668896 0.489085
H  -6.778516 -1.78489 -2.83093
H  -8.29725 -1.129263 -2.157736
H  -8.315129 -2.681557 -3.044484
