program: Gaussian 09
title: 000014027
version: EM64L-G09RevD.01
frameworkgroup: C1[X(C16H38N2)]
method: RPBEPBE
basis: SDD
operation: Freq
keyword: #p
keyword: freq=noraman
keyword: PBEPBE/SDD
title: #p freq=noraman PBEPBE/SDD
converged: YES YES NO NO
title: Mulliken charges:
elementType: N N C C C C C C C C C C C C C C C C H H H H H H H H H H H H H H H H H H H H H H H H H H H H H H H H H H H H H H
charge: -0.113425 -0.113540 -0.355784 -0.355437 -0.403388 -0.403655 -0.302053 -0.299777 -0.298953 -0.299179 -0.299853 -0.301792 -0.702312 -0.698447 -0.697665 -0.697801 -0.698266 -0.702274 0.264232 0.266638 0.266588 0.264320 0.234933 0.236969 0.234940 0.237176 0.274394 0.259684 0.269800 0.253117 0.263193 0.245108 0.263162 0.245397 0.269726 0.252936 0.274285 0.259534 0.237430 0.248224 0.284150 0.221320 0.257793 0.281057 0.247183 0.250135 0.276552 0.276553 0.250082 0.247264 0.281136 0.257566 0.221267 0.284176 0.248182 0.237397
chargesum: 2.00000
title: Mulliken charges with hydrogens summed into heavy atoms:
elementType: N N C C C C C C C C C C C C C C C C
charge: -0.113425 -0.113540 0.175086 0.175470 0.068514 0.068462 0.232025 0.223141 0.209347 0.209380 0.222809 0.232027 0.067492 0.061723 0.076205 0.076098 0.061703 0.067481
polarizability: 2.06795657e+02 -1.25153869e-02 1.73350341e+02 1.07358383e+00 2.31553769e-03 1.67374125e+02
1716.lowfreq: -0.0008 0.0002 0.0005 5.4213 7.6977 18.2879 19.3839 32.6805 53.4173
frequency: 19.2519 32.6476 53.3600 69.9770 91.0348 102.3487 103.6088 114.8308 120.9937 128.3102 141.5172 142.3699 159.2914 171.0392 200.4562 229.4496 248.6033 256.6573 256.9622 263.4381 265.3240 295.8255 296.1049 312.2584 332.7638 340.6760 350.3685 365.7156 366.6381 381.5351 387.6319 441.6970 454.5621 471.7027 491.6629 548.7837 570.4456 666.5409 671.2661 744.8051 767.6013 771.1127 772.0859 785.2721 788.8949 795.1263 807.8545 838.5361 861.0357 861.1883 865.2125 914.1038 922.8291 951.5920 1007.3200 1008.4864 1021.6775 1023.7026 1025.5529 1029.1235 1039.2191 1043.2327 1067.3606 1073.8623 1076.6463 1079.4817 1089.7170 1111.7458 1121.1811 1140.8471 1151.0552 1162.5694 1169.7081 1171.0106 1179.7442 1186.1859 1222.9726 1271.7758 1281.9452 1284.3604 1287.7076 1288.5550 1291.2966 1310.5084 1318.9771 1335.5745 1337.0626 1346.5358 1352.3000 1358.6731 1368.8743 1369.8219 1375.5670 1376.9015 1385.4874 1390.7823 1415.4967 1416.2442 1416.5917 1416.7281 1419.8435 1420.0146 1461.6004 1462.4608 1470.0102 1472.2631 1474.1510 1475.0493 1475.8141 1476.8248 1479.2597 1480.2432 1482.9207 1483.4522 1486.2891 1486.5125 1487.8495 1490.5668 1492.0831 1492.6302 1497.9368 1497.9846 1502.2317 1504.7533 2999.0075 3006.2355 3006.3155 3006.9159 3007.5706 3007.5973 3010.7608 3010.8110 3029.7621 3030.8122 3035.3533 3035.6583 3038.5086 3038.5797 3045.1157 3045.3190 3049.4750 3069.2039 3090.9364 3091.3525 3093.2939 3093.7491 3094.5783 3094.8432 3096.6164 3096.9563 3098.1644 3098.6039 3100.2275 3102.0680 3102.7230 3104.1786 3119.7198 3119.9080 3121.2735 3121.3532 3125.2725 3125.3423
redmass: 3.1633 3.3365 3.2852 2.3863 2.4294 1.8924 2.0388 1.7035 2.1308 2.3379 2.1680 2.1176 2.4878 2.2571 2.9954 1.8219 1.3639 1.0670 1.0650 1.3665 1.3358 2.2132 2.0214 1.9255 2.0613 1.9033 2.1509 2.4338 2.2944 3.0194 2.8102 2.9391 2.8204 2.9063 2.7835 2.5886 2.6509 2.9698 2.9514 1.1101 1.3404 1.5479 1.4085 1.2611 1.2450 1.4305 1.1576 1.6666 1.8138 1.7388 1.9062 2.4320 2.6617 1.3702 1.8847 1.9368 2.4613 2.3659 2.4113 2.6649 3.3238 3.6850 2.4480 1.9267 1.9958 1.8398 1.7300 2.1612 2.5017 1.6730 1.6766 1.8745 2.0484 1.9951 1.9102 1.9521 1.3795 1.1746 1.1046 1.1122 1.1468 1.1370 1.1925 1.1206 1.0774 1.1852 1.1960 1.2081 1.2362 1.2938 1.2987 1.2908 1.2882 1.2833 1.3271 1.2852 1.1987 1.1988 1.2057 1.2053 1.1801 1.1801 1.0647 1.0600 1.0726 1.0707 1.0640 1.0489 1.0502 1.0622 1.0633 1.0654 1.0612 1.0595 1.0542 1.0493 1.0552 1.0564 1.0584 1.0739 1.0609 1.0609 1.0727 1.0796 1.0589 1.0380 1.0380 1.0588 1.0380 1.0382 1.0381 1.0381 1.0596 1.0588 1.0605 1.0598 1.0614 1.0614 1.0604 1.0604 1.0999 1.1045 1.1028 1.1019 1.1012 1.1007 1.1024 1.1018 1.0997 1.0991 1.1010 1.1008 1.1012 1.1002 1.1011 1.1041 1.1034 1.1034 1.1037 1.1037 1.1036 1.1037
irintensity: 0.0102 0.0001 0.0044 0.3262 0.0011 0.1145 0.0013 0.9297 0.6386 0.2859 0.0377 0.1315 0.4327 0.0015 0.2543 0.1637 0.0007 0.0906 0.0919 0.2427 0.0325 0.0075 0.0033 0.0899 0.1027 0.0000 0.0763 0.1599 0.2321 0.3401 0.5385 0.0227 3.8062 4.6248 2.2454 0.8180 0.4871 3.7821 1.5388 18.2673 0.8943 50.0926 3.1370 31.9522 0.8796 20.7422 1.6032 4.8048 0.1712 1.5724 0.2901 3.3660 5.1529 1.4062 29.0113 22.3872 0.4059 40.8651 10.1978 30.5395 0.5632 19.6507 0.0782 2.4092 1.2536 3.3340 7.6534 1.4677 0.0392 0.9541 4.8842 24.1417 6.1377 2.5502 0.3122 6.9548 5.0131 14.1989 3.4840 3.8429 5.9675 2.2744 18.8246 0.1078 4.3271 3.9915 0.5577 0.9290 4.0648 0.0748 0.0486 1.9007 0.5722 0.0152 1.0611 6.0361 4.2108 69.6615 22.4440 29.7312 32.9669 22.9448 0.6980 4.8784 0.7219 16.5298 19.8668 8.2400 0.0366 54.7128 1.3216 92.9799 25.6127 25.8669 2.1627 8.5546 16.0054 24.1844 0.4763 3.7504 11.9113 11.0141 3.7197 1.1310 0.0819 6.2723 4.6989 15.2387 3.4290 2.0060 2.8628 2.6372 0.0462 16.7573 20.0810 2.2294 9.3793 10.7929 4.6349 5.0066 0.6126 7.9049 7.6846 0.9019 6.9331 0.6064 10.6261 0.4868 0.2721 0.2328 0.8409 0.0206 2.5158 23.2448 0.0974 19.0269 67.8118 0.0738 14.4941 32.0375 12.1374 12.8349
temp: 298.150 k
press: 1.00000 atm
elementType: 7 7 6 6 6 6 6 6 6 6 6 6 6 6 6 6 6 6 1 1 1 1 1 1 1 1 1 1 1 1 1 1 1 1 1 1 1 1 1 1 1 1 1 1 1 1 1 1 1 1 1 1 1 1 1 1
symmnumber: 1
zpe: 1385287.5 jmol-1
zpe.correction: 0.527628 hartree
zpe.thermalcorrener: 0.551507 hartree
zpe.thermalcorrenthalpy: 0.552451 hartree
zpe.thermalcorrgfe: 0.475070 hartree
zpe.sumelectzpe: -739.894315 hartree
zpe.sumelectthermal: -739.870437 hartree
zpe.sumelectthermalent: -739.869493 hartree
zpe.sumelectthermalfe: -739.946874 hartree
dipole: 0.0028 -0.0899 -0.0008
dipole: 0.0900
quadrupole: 27.0681 -90.3257 -93.4134
quadrupole: 0.0080 -0.6402 -0.0039
quadrupole: 79.2917 -38.1020 -41.1897 0.0080 -0.6402 -0.0039
hfenergy: -740.4219436 hartree
pointgroup: C01 [X(C16H38N2)]
dipole: 0.0013322 0.0353719 0.0006849 debye
polarizability: 206.8154502|-0.2101037|173.350999|-0.5652969|0.0664023|167.3536732 unknown
InChI: InChI=1S/C16H38N2/c1-7-17(8-2,9-3)15-13-14-16-18(10-4,11-5)12-6/h7-16H2,1-6H3
charge 2 multiplicity 1
56 atoms
N  -3.271102 0.027236 -0.099262
N  3.272192 -0.019598 0.099173
C  -1.869427 -0.040116 0.553542
C  1.869891 -0.053821 -0.554884
C  -0.662333 -0.020711 -0.410047
C  0.663093 -0.032421 0.408931
C  -4.343135 -0.191456 1.012578
C  -3.448405 -1.075008 -1.182208
C  -3.451929 1.420762 -0.771994
C  3.472383 1.35693 0.800752
C  3.434763 -1.146859 1.158691
C  4.34124 -0.22988 -1.016945
C  -4.410643 0.892083 2.094898
C  -3.217601 -2.515975 -0.71194
C  -4.8503 1.716613 -1.327837
C  4.874869 1.62154 1.362072
C  3.177714 -2.574181 0.660811
C  4.421642 0.873217 -2.078465
H  -1.815282 0.820056 1.241947
H  -1.854618 -0.960575 1.162353
H  1.841437 -0.963214 -1.179636
H  1.829307 0.819034 -1.228066
H  -0.683434 -0.901525 -1.078536
H  -0.680315 0.881444 -1.049122
H  0.674928 -0.92063 1.067807
H  0.6909 0.862476 1.057789
H  -5.30737 -0.277628 0.485787
H  -4.114876 -1.171414 1.462281
H  -4.477529 -0.960443 -1.558368
H  -2.761968 -0.810786 -2.004426
H  -3.173033 2.16566 -0.007924
H  -2.706654 1.463945 -1.583976
H  3.203653 2.121149 0.052292
H  2.727935 1.393463 1.613757
H  4.46738 -1.057732 1.532035
H  2.756491 -0.887975 1.989332
H  5.304444 -0.337668 -0.492277
H  4.100939 -1.198234 -1.485094
H  -3.488844 0.973148 2.694713
H  -4.673799 1.887094 1.700346
H  -5.215425 0.606416 2.795231
H  -2.195322 -2.698927 -0.339308
H  -3.939964 -2.845387 0.052184
H  -3.36369 -3.17658 -1.584845
H  -5.15471 1.034152 -2.138013
H  -5.634251 1.726841 -0.553328
H  -4.82399 2.730574 -1.765212
H  4.862485 2.625658 1.822109
H  5.658442 1.638441 0.587257
H  5.170116 0.916835 2.1564
H  3.316949 -3.254239 1.519797
H  3.890721 -2.900369 -0.113457
H  2.150724 -2.733028 0.290146
H  5.223819 0.592028 -2.783558
H  4.695347 1.85758 -1.664765
H  3.501248 0.975705 -2.67712
