program: Gaussian 09
title: 000155176
version: EM64L-G09RevD.01
frameworkgroup: C1[X(C22H28N2O3)]
method: RPBEPBE
basis: SDD
operation: Freq
keyword: #p
keyword: freq=noraman
keyword: PBEPBE/SDD
title: #p freq=noraman PBEPBE/SDD
converged: YES YES NO NO
title: Mulliken charges:
elementType: O O O N N C C C C C C C C C C C C C C C C C C C C C C H H H H H H H H H H H H H H H H H H H H H H H H H H H H
charge: -0.417216 -0.237528 -0.259013 -0.066423 -0.278235 0.433249 -0.283350 -0.564313 0.218033 -0.518082 0.035958 -0.455950 -0.436964 -0.383167 0.075418 -0.450541 -0.542990 0.247282 0.180655 -0.738894 0.177035 -0.360131 -0.438840 -0.260227 -0.252268 -0.219937 -0.670711 0.236102 0.238040 0.237361 0.271149 0.217369 0.187784 0.245966 0.210038 0.196834 0.210968 0.203064 0.223227 0.223537 0.228358 0.218068 0.216149 0.227012 0.217177 0.371619 0.253447 0.235222 0.218804 0.218610 0.239478 0.233732 0.216977 0.229819 0.241239
chargesum: 0.00000
title: Mulliken charges with hydrogens summed into heavy atoms:
elementType: O O O N N C C C C C C C C C C C C C C C C C C C C C C
charge: -0.045597 -0.237528 -0.259013 -0.066423 -0.278235 0.433249 -0.047248 -0.088912 0.218033 -0.029564 0.035958 -0.022199 -0.030092 0.030865 0.075418 -0.003778 -0.096563 0.247282 0.180655 -0.078556 0.177035 -0.106683 -0.203618 -0.041423 -0.033658 0.253273 0.017324
polarizability: 2.90632747e+02 -2.11992002e+01 2.70586699e+02 2.24222267e+01 9.03832050e+00 2.03385127e+02
1716.lowfreq: -6.9383 -0.0006 -0.0005 -0.0002 3.9908 10.5065 22.4372 33.4139 56.5290
frequency: 22.3438 33.2596 56.5211 60.6402 68.7181 74.9661 95.5339 118.8829 133.7783 144.1814 161.0131 167.1749 188.9739 195.8387 220.4553 227.8424 244.5399 250.3371 277.2866 288.9296 298.3000 316.8523 319.9074 331.5025 337.1603 345.6783 359.4226 374.7378 401.0233 419.5940 435.5463 446.3143 459.9393 501.2344 515.9818 527.9548 549.5727 566.8558 585.2908 589.3869 598.8737 645.4809 652.0938 711.8947 717.9748 740.3425 748.9534 758.8921 761.2694 775.5441 779.5602 791.4361 798.8688 815.4269 841.2439 854.5468 859.2741 885.7419 892.9665 905.9510 920.1305 932.4883 940.3637 952.6918 969.0667 970.6526 993.3884 1002.0964 1015.0536 1018.4623 1022.4702 1030.7680 1050.2588 1058.4244 1071.0426 1090.4532 1098.2277 1114.5397 1118.1831 1129.2576 1133.7297 1140.5241 1153.2032 1160.0700 1168.5567 1181.9244 1190.5137 1195.5282 1208.0328 1220.0556 1246.4328 1249.5353 1258.5487 1271.4699 1282.5885 1288.1628 1296.4444 1297.4032 1313.2224 1319.4871 1330.8858 1338.5927 1341.8761 1342.3199 1352.4886 1358.0485 1366.2557 1368.9114 1371.9276 1396.2260 1402.2038 1406.6569 1412.6627 1448.0526 1450.9843 1456.3714 1457.1953 1462.7704 1464.3591 1466.9921 1471.2947 1473.3593 1473.6249 1478.1140 1483.8825 1484.8715 1493.5470 1577.5390 1596.8321 1598.1083 1623.8614 2884.0709 2923.3604 2957.8374 2962.7985 2979.2517 2981.8973 2989.0536 2999.2525 3001.1380 3003.5688 3003.9968 3016.2967 3016.5508 3030.7779 3044.6546 3049.8938 3060.3085 3068.3663 3073.9306 3076.8010 3078.2630 3095.8285 3113.6301 3122.0280 3134.3839 3151.0782 3164.9695 3432.9925
redmass: 3.2802 4.3644 3.4899 3.0923 4.2158 2.6227 2.9549 3.8910 3.2371 3.9144 3.3692 1.8997 2.9521 2.5463 4.6475 2.0774 2.0973 1.8236 2.6484 2.6541 2.8460 3.7493 2.2815 3.4293 3.6020 3.3643 2.4587 2.4548 4.2938 1.6422 2.7379 3.4439 2.7071 5.2727 3.1320 4.7166 3.7798 4.0937 4.1162 3.1038 5.1811 5.4913 5.1358 3.1221 4.8610 3.1042 1.4451 3.4530 4.0337 1.7185 2.1214 3.0398 1.1266 3.7865 2.7821 1.5380 1.8228 3.3705 2.8321 2.6640 2.7744 1.3912 2.3020 3.0772 2.9989 1.3003 2.5867 2.0122 2.2225 2.1489 2.2385 2.3962 2.2630 2.3783 1.9046 2.5901 3.0872 2.2735 2.5455 1.6949 1.4610 2.3515 2.4984 2.0229 1.3273 1.4000 1.5355 3.7185 1.4786 1.8547 2.1081 1.1470 1.4380 1.2787 1.4031 1.3560 1.4104 1.4296 2.0311 1.6061 1.4208 1.4494 1.4985 1.6923 1.4526 1.4491 1.6666 1.4403 1.5596 1.2238 1.2691 4.4568 4.6579 1.0940 1.0988 1.9703 1.4297 1.0396 1.1268 1.0892 1.0722 1.7934 1.4853 1.0481 1.0763 1.0639 1.0592 6.5798 8.6161 9.7807 7.5874 1.0688 1.0821 1.0610 1.0656 1.0367 1.0655 1.0617 1.0360 1.0608 1.0914 1.0646 1.0872 1.0588 1.0948 1.1009 1.1048 1.1017 1.0987 1.0997 1.0994 1.1070 1.0985 1.1032 1.0850 1.0900 1.0950 1.0988 1.0649
irintensity: 0.1054 0.3486 0.6537 0.2468 2.2147 0.2969 0.7131 0.4669 0.1444 2.4571 1.9122 0.4085 2.0714 1.2332 5.9060 2.7564 1.4648 1.1806 5.2754 1.4664 14.6608 4.3142 6.7245 27.9019 6.5892 2.8144 7.0472 0.7572 12.0961 50.8197 22.6990 1.0356 1.0463 3.9365 11.3772 10.0984 0.5488 7.1883 0.1014 4.6863 4.2049 1.8756 7.0152 1.9430 9.5813 5.4551 81.0220 11.7126 5.7795 6.5431 3.1316 2.3616 3.5290 13.8524 24.3021 3.8793 1.5688 5.2847 11.5700 11.6186 2.1801 2.4136 2.4999 3.3304 3.0631 0.2458 1.7571 26.6235 73.4684 25.4533 38.2530 18.1494 36.8767 12.1443 9.2289 34.2126 105.1093 2.0882 3.7539 21.2712 7.7990 19.7969 47.1485 29.9974 30.4154 32.3659 5.8933 246.0808 11.5088 17.5529 0.2227 0.1937 22.6890 4.1882 10.5760 19.0663 18.7350 8.1064 23.5035 37.1052 7.7667 1.7601 15.3563 48.0841 15.8837 8.3560 21.0553 4.7918 10.6990 17.8101 26.6197 28.6784 25.4933 5.7429 10.4856 17.1566 25.8893 12.1142 9.0236 9.4820 4.7279 13.1460 3.3650 7.4467 17.1407 13.8826 5.7601 0.9210 41.7200 101.9510 2.5925 54.0098 25.8872 44.1201 34.6887 35.8697 44.9420 23.6940 14.2700 14.1652 66.1804 14.8371 75.4183 7.8339 9.1787 25.3124 45.7411 58.3515 45.1969 18.7707 40.6008 5.4409 24.2595 33.9639 1.0720 14.4251 32.4399 23.0618 52.2475
temp: 298.150 k
press: 1.00000 atm
elementType: 8 8 8 7 7 6 6 6 6 6 6 6 6 6 6 6 6 6 6 6 6 6 6 6 6 6 6 1 1 1 1 1 1 1 1 1 1 1 1 1 1 1 1 1 1 1 1 1 1 1 1 1 1 1 1
symmnumber: 1
zpe: 1211165.5 jmol-1
zpe.correction: 0.461309 hartree
zpe.thermalcorrener: 0.485930 hartree
zpe.thermalcorrenthalpy: 0.486874 hartree
zpe.thermalcorrgfe: 0.407995 hartree
zpe.sumelectzpe: -1188.309726 hartree
zpe.sumelectthermal: -1188.285104 hartree
zpe.sumelectthermalent: -1188.284160 hartree
zpe.sumelectthermalfe: -1188.363039 hartree
dipole: -0.5316 -2.0148 2.7731
dipole: 3.4687
quadrupole: -153.4540 -149.5015 -161.6482
quadrupole: 7.7908 -6.1156 -4.0422
quadrupole: 1.4139 5.3664 -6.7803 7.7908 -6.1156 -4.0422
hfenergy: -1188.7710341 hartree
pointgroup: C01 [X(C22H28N2O3)]
dipole: -0.1321117 -0.688552 1.1708454 debye
polarizability: 294.6112297|-15.7269755|267.4540846|24.8451428|4.4113072|202.5392592 unknown
InChI: InChI=1S/C22H28N2O3/c1-3-21-11-7-12-23-13-10-16-15-8-5-6-9-17(15)24(18(16)19(21)23)22(26,14-21)20(25)27-4-2/h5-6,8-9,19,26H,3-4,7,10-14H2,1-2H3
charge 0 multiplicity 1
55 atoms
O  -0.216301 -1.409375 -2.16329
O  -1.72319 -2.296834 1.051601
O  -2.289856 -2.773411 -1.152913
N  2.671695 1.491894 0.87669
N  -0.583929 0.060518 -0.285297
C  2.181547 -0.872007 0.005361
C  1.707633 0.344973 0.85937
C  0.974062 -1.858955 -0.055589
C  0.360837 0.844633 0.402652
C  2.618279 -0.373075 -1.400681
C  -0.331166 -1.321506 -0.70988
C  3.349487 -1.570536 0.774993
C  3.661141 0.762211 -1.29649
C  3.085907 1.937932 -0.483302
C  -0.095484 2.148243 0.536823
C  2.103825 2.601389 1.69735
C  0.77177 3.227275 1.143419
C  -1.683559 0.88499 -0.614493
C  -1.398908 2.204461 -0.100037
C  4.09374 -2.690726 0.017876
C  -1.551068 -2.211608 -0.30289
C  -2.874213 0.599366 -1.316503
C  -2.348489 3.240559 -0.291846
C  -3.800603 1.650475 -1.491418
C  -3.542772 2.956082 -0.984341
C  -2.920245 -3.072424 1.53223
C  -2.919692 -2.976391 3.052216
H  1.63377 -0.006667 1.912519
H  0.736397 -2.170915 0.979451
H  1.24897 -2.760047 -0.631315
H  1.734698 -0.003449 -1.952509
H  3.010909 -1.219195 -1.993667
H  2.934059 -1.98806 1.716494
H  4.068915 -0.788775 1.082067
H  4.593124 0.40296 -0.820479
H  3.926849 1.121702 -2.309015
H  3.847715 2.730043 -0.351334
H  2.236411 2.379769 -1.059046
H  2.872962 3.38991 1.79634
H  1.913934 2.191849 2.70824
H  0.996017 4.002592 0.38187
H  0.256979 3.751927 1.973194
H  3.408662 -3.481932 -0.33996
H  4.641076 -2.299704 -0.858575
H  4.835771 -3.171758 0.681455
H  -1.041992 -1.855471 -2.505183
H  -3.086238 -0.392341 -1.726779
H  -2.154146 4.248897 0.091129
H  -4.732808 1.457548 -2.03425
H  -4.284154 3.747818 -1.140935
H  -3.817151 -2.619686 1.073721
H  -2.820945 -4.109131 1.16391
H  -3.790216 -3.523736 3.457144
H  -2.003309 -3.41867 3.478443
H  -2.987307 -1.92523 3.378864
