program: Gaussian 09
title: 000155173
version: EM64L-G09RevD.01
frameworkgroup: C1[X(C15H20O3)]
method: RPBEPBE
basis: SDD
operation: Freq
keyword: #pfreq=noraman
keyword: PBEPBE/SDD
title: #p freq=noraman PBEPBE/SDD
converged: YES YES NO NO
title: Mulliken charges:
elementType: O O O C C C C C C C C C C C C C C C H H H H H H H H H H H H H H H H H H H H
charge: -0.233678 -0.206978 -0.212715 -0.085921 -0.209425 -0.469229 -0.187420 -0.503335 0.528880 0.313786 -0.440386 -0.593335 -0.725780 0.078892 -0.506352 -0.676127 0.241465 -0.769838 0.237834 0.261372 0.248442 0.205227 0.199584 0.231616 0.212702 0.224956 0.230706 0.236565 0.223272 0.225383 0.221037 0.244012 0.236597 0.227239 0.257801 0.241268 0.258793 0.233088
chargesum: 0.00000
title: Mulliken charges with hydrogens summed into heavy atoms:
elementType: O O O C C C C C C C C C C C C C C C
charge: -0.233678 -0.206978 -0.212715 0.151913 0.051947 -0.015559 0.012164 -0.059016 0.528880 0.313786 -0.215430 -0.126064 -0.056089 0.078892 -0.025743 -0.191087 0.241465 -0.036688
polarizability: 2.18508198e+02 -1.37074261e+00 1.34550976e+02 1.43515807e+01 5.00661480e+00 1.48478214e+02
1716.lowfreq: -19.0496 -10.7722 -7.5202 -0.0006 -0.0006 -0.0004 24.1422 26.2885 30.7247
frequency: 23.7825 26.1699 30.4840 52.7393 80.6702 91.3773 100.0727 113.3027 143.7882 161.3373 212.4467 240.9207 248.3490 277.3603 292.3568 310.7774 316.1212 325.5534 352.0554 401.1089 409.0877 453.4578 466.7058 487.2035 547.0044 566.8409 580.3584 621.6164 634.2494 655.2295 703.5360 725.0569 745.5526 759.1544 783.9507 811.2181 828.5022 851.5387 898.0031 911.3546 919.9494 934.2642 946.2303 954.3911 977.4960 982.4004 1006.4180 1021.7764 1035.1553 1044.8275 1049.6158 1087.2301 1093.2917 1110.0494 1141.2450 1152.8030 1162.7229 1173.9733 1195.0968 1205.7878 1239.3919 1251.2928 1256.7789 1265.5157 1277.6427 1291.4390 1307.7274 1317.2473 1322.6470 1331.7736 1344.0743 1358.3795 1370.2717 1370.4569 1393.4105 1418.4644 1429.1100 1443.2109 1456.4688 1464.5586 1467.2851 1476.3575 1480.2141 1498.3666 1634.7421 1671.7799 1673.2883 1684.2635 2942.1286 2959.6130 2975.5735 2979.1107 2980.6356 2994.4096 3000.0412 3001.3485 3014.5583 3046.8193 3049.6417 3060.2104 3065.0216 3066.6380 3073.5098 3085.8956 3089.2181 3098.2505 3120.5725 3206.4647
redmass: 6.0599 4.9140 3.9521 3.2577 3.0278 2.6398 2.2358 1.3524 3.9519 4.6866 1.0778 3.7792 2.8643 3.0552 3.7257 4.8767 2.4818 3.5208 2.8780 3.6169 3.3999 2.9556 2.1977 3.3458 3.6149 3.0140 3.5895 3.1763 3.0128 3.0332 2.4671 4.1429 1.4842 3.1892 2.0508 2.4060 2.7333 1.5513 1.7757 1.7142 2.1766 2.5168 2.1816 1.8500 1.4302 1.7526 2.2619 2.0399 3.0922 3.3997 2.6872 2.1140 2.2606 2.9568 2.2231 1.4575 1.8206 1.6247 1.3719 1.7348 1.6096 1.6871 1.3195 1.2435 1.3715 1.2999 1.3226 1.4965 1.5868 1.4620 1.3479 1.4188 1.2397 1.5482 1.2430 1.1744 1.0856 1.0655 1.0566 1.0761 1.0840 1.0656 1.0599 1.0775 7.7797 7.0064 7.4396 11.1640 1.0819 1.0620 1.0825 1.0356 1.0383 1.0612 1.0603 1.0597 1.0945 1.0992 1.0968 1.1021 1.0936 1.0952 1.1001 1.0992 1.0916 1.0616 1.1005 1.1154
irintensity: 5.9972 2.4476 2.7034 0.1480 1.3194 1.1552 2.2259 0.3729 1.6084 3.9472 0.2124 2.3200 0.9504 1.2152 2.9556 1.4790 0.5892 0.6854 0.8699 3.7404 2.9643 1.8854 2.2048 1.7368 9.7296 7.0675 9.1611 9.0101 2.5872 1.1405 1.3114 1.6465 2.0757 5.2145 8.8083 4.7761 5.4199 13.8951 4.0445 15.6335 43.4456 72.0128 4.1469 2.0438 32.4731 23.6322 15.1426 24.4999 127.7892 15.0256 1.2799 5.5255 1.2062 7.2679 9.7929 6.5912 17.1487 42.5772 3.5649 28.0569 17.1402 31.0857 57.8237 11.0462 34.2790 12.4681 0.4164 3.1169 8.0030 31.2661 8.4077 5.1393 61.0565 0.4003 12.9623 25.1624 22.5791 18.7511 18.9046 5.1186 2.6057 17.2571 13.6023 15.6665 118.6556 48.5999 7.2195 269.2929 34.9029 12.5610 9.6160 27.2893 4.1590 7.9332 31.1572 18.0997 6.7848 23.2807 9.5074 18.1493 32.1503 15.8128 35.5162 32.7567 50.9958 5.0318 15.0949 3.6176
temp: 298.150 k
press: 1.00000 atm
elementType: 8 8 8 6 6 6 6 6 6 6 6 6 6 6 6 6 6 6 1 1 1 1 1 1 1 1 1 1 1 1 1 1 1 1 1 1 1 1
symmnumber: 1
zpe: 829855.1 jmol-1
zpe.correction: 0.316075 hartree
zpe.thermalcorrener: 0.334561 hartree
zpe.thermalcorrenthalpy: 0.335505 hartree
zpe.thermalcorrgfe: 0.267415 hartree
zpe.sumelectzpe: -807.866816 hartree
zpe.sumelectthermal: -807.848330 hartree
zpe.sumelectthermalent: -807.847386 hartree
zpe.sumelectthermalfe: -807.915476 hartree
dipole: -2.5953 -0.1725 3.0513
dipole: 4.0095
quadrupole: -144.1639 -107.1779 -105.0941
quadrupole: 23.3801 14.5064 -4.7115
quadrupole: -25.3519 11.6341 13.7178 23.3801 14.5064 -4.7115
hfenergy: -808.1828908 hartree
pointgroup: C01 [X(C15H20O3)]
dipole: -0.9830226 1.172748 -0.382963 debye
polarizability: 218.8706739|13.7747498|143.8321972|2.4866944|-7.1572693|138.8345162 unknown
InChI: InChI=1S/C15H20O3/c1-9-8-14-13(11(3)15(17)18-14)7-6-12(9)5-4-10(2)16/h6,9,13-14H,3-5,7-8H2,1-2H3
charge 0 multiplicity 1
38 atoms
O  2.383461 -0.82671 1.569239
O  4.699888 -0.588996 1.660393
O  -5.401417 0.058924 -0.776461
C  1.254924 -0.292385 0.727511
C  1.801367 1.039311 0.109007
C  0.863152 -1.362138 -0.301494
C  -0.58264 -1.209219 -0.862466
C  1.248847 1.33545 -1.309925
C  -1.072612 0.219235 -1.142387
C  3.309114 0.863398 0.197291
C  -0.272437 1.303683 -1.357844
C  -2.590419 0.384684 -1.1750
C  -0.734204 -2.094952 -2.133523
C  3.607325 -0.22355 1.190811
C  -3.212862 0.449048 0.241853
C  4.29722 1.523425 -0.455056
C  -4.745949 0.407438 0.241119
C  -5.436642 0.815195 1.537887
H  0.428364 -0.112308 1.434584
H  1.503887 1.871306 0.778935
H  0.938689 -2.348604 0.193016
H  1.599964 -1.373235 -1.127204
H  -1.267524 -1.631897 -0.09462
H  1.685793 0.613383 -2.025284
H  1.603846 2.333096 -1.627324
H  -0.768169 2.262052 -1.5713
H  -2.863519 1.306648 -1.72032
H  -3.074761 -0.447103 -1.719976
H  -0.426628 -3.135249 -1.918348
H  -1.7767 -2.118502 -2.495821
H  -0.097987 -1.709653 -2.951188
H  -2.873056 1.353703 0.784519
H  -2.87006 -0.409683 0.859188
H  4.092537 2.314122 -1.184895
H  5.344639 1.268604 -0.256138
H  -5.437579 1.920143 1.61919
H  -6.481064 0.46617 1.542412
H  -4.901487 0.425765 2.42282
