program: Gaussian 09
title: 000155149
version: EM64L-G09RevD.01
frameworkgroup: C1[X(C2H5N3O2)]
method: RPBEPBE
basis: SDD
operation: Freq
keyword: #pfreq=noraman
keyword: PBEPBE/SDD
title: #p freq=noraman PBEPBE/SDD
converged: YES YES YES YES
title: Mulliken charges:
elementType: O O N N N C C H H H H H
charge: -0.262417 -0.239480 -0.134538 -0.617232 0.042038 -0.613229 0.327635 0.257468 0.275956 0.257469 0.359094 0.347236
chargesum: 0.00000
title: Mulliken charges with hydrogens summed into heavy atoms:
elementType: O O N N N C C
charge: -0.262417 -0.239480 -0.134538 0.089097 0.042038 0.177664 0.327635
polarizability: 7.16674543e+01 4.58570407e+00 5.75194675e+01 1.69231443e-03 1.23894192e-03 2.68347139e+01
1716.lowfreq: -0.7917 -0.0010 -0.0008 0.0007 8.8841 10.8745 102.3630 133.1091 194.6250
frequency: 102.3584 133.0656 194.6238 251.0517 310.3993 387.9211 436.9421 490.7107 548.1686 632.9907 645.1767 711.6430 801.8207 897.6412 1057.1366 1117.5941 1164.4999 1213.2744 1352.3700 1367.6982 1418.5921 1463.1739 1473.3448 1565.3632 1683.9821 3006.6390 3091.7494 3148.5489 3511.5061 3685.4591
redmass: 5.4861 1.0942 5.0359 6.1563 3.1352 5.6798 5.1507 4.9132 1.1475 4.4624 1.1032 9.6002 5.4756 2.7201 2.3004 1.3271 3.3798 2.6800 4.5134 5.0154 1.2815 1.0431 1.0848 1.2209 8.0384 1.0335 1.1010 1.1010 1.0470 1.1032
irintensity: 12.2617 0.2551 0.7750 23.4038 7.8083 12.7643 2.9209 3.2301 144.2436 35.7600 159.0722 36.2059 21.5234 181.1933 4.3367 0.4432 93.2612 14.2109 278.5666 35.0470 72.9082 22.8022 37.7943 166.6106 307.8348 10.9254 13.7212 0.2072 48.5376 78.9315
temp: 298.150 k
press: 1.00000 atm
elementType: 8 8 7 7 7 6 6 1 1 1 1 1
symmnumber: 1
zpe: 226485.7 jmol-1
zpe.correction: 0.086264 hartree
zpe.thermalcorrener: 0.093629 hartree
zpe.thermalcorrenthalpy: 0.094573 hartree
zpe.thermalcorrgfe: 0.054819 hartree
zpe.sumelectzpe: -393.320210 hartree
zpe.sumelectthermal: -393.312845 hartree
zpe.sumelectthermalent: -393.311901 hartree
zpe.sumelectthermalfe: -393.351655 hartree
dipole: 0.9571 -0.9419 0.0000
dipole: 1.3428
quadrupole: -48.6886 -35.9890 -40.4181
quadrupole: -11.3139 -0.0002 -0.0008
quadrupole: -6.9901 5.7096 1.2805 -11.3139 -0.0002 -0.0008
hfenergy: -393.4064742 hartree
pointgroup: C01 [X(C2H5N3O2)]
dipole: 0.3425566 -0.4022033 0.0000154 debye
dipolederiv: -0.9413835 -0.2914958 0.0000042 -0.1711833 -0.812396 0.0000141 -0.0000863 -0.000079 -0.3736281 -1.1211453 -0.3669882 -0.000038 0.30545 -0.170266 -0.0000002 0.0000431 0.0000102 -0.1881643 -1.3808888 -0.0107141 -0.0000453 -0.4201061 -0.3970225 -0.0000104 -0.0000356 -0.0000069 -0.1118039 -0.4554329 0.2311214 0.0000516 0.2983671 -1.1481555 -0.0000402 0.0000447 0.0000008 -0.702293 1.3174798 0.6053744 0.0000399 0.5210283 0.11984 0.0000227 0.0000091 0.0000017 -0.05745 0.0528582 -0.0136632 -0.0000045 -0.1243318 0.1445134 -0.0000109 0.0000097 -0.0000085 0.2111752 1.9024043 -0.0353438 0.0000342 -0.2970972 1.5603673 -0.0000061 0.0000773 0.0000294 0.3396201 0.0441587 0.0524253 -0.0921271 -0.006585 0.0512803 -0.0161555 -0.0691976 0.0408161 -0.0280323 0.0713865 -0.1139571 -0.0000026 -0.0389968 0.1064222 -0.0000037 -0.0000016 -0.0000051 0.1439985 0.0441601 0.0524105 0.0921291 -0.0065875 0.0512835 0.0161701 0.069192 -0.040803 -0.02803 0.2697229 -0.0664708 -0.0000208 -0.0365522 0.2654842 0.0000122 -0.0000195 0.0000241 0.3898647 0.1966802 -0.0426987 -0.0000209 -0.0234053 0.2286493 0.0000078 -0.0000352 0.0000203 0.4047431 unknown
polarizability: 72.36027|3.2782223|56.8266519|0.0017945|0.0010856|26.8347139 unknown
InChI: InChI=1S/C2H5N3O2/c1-5(4-7)2(3)6/h3H2,1H3
charge 0 multiplicity 1
12 atoms
O  2.062252 0.759133 0.000249
O  -2.39462 -0.377721 0.000045
N  -0.242084 0.265288 0.000056
N  1.362306 -1.478206 0.000119
N  -1.177636 -0.770635 -0.000006
C  -0.640989 1.681918 0.000146
C  1.162661 -0.120981 0.000052
H  -1.249774 1.902078 -0.893578
H  0.279395 2.2823 0.000185
H  -1.24978 1.901967 0.893893
H  0.563137 -2.113461 0.00008
H  2.319933 -1.81968 0.000257
