program: Gaussian 09
title: 000155148
version: EM64L-G09RevD.01
frameworkgroup: C1[X(C16H16O5)]
method: RPBEPBE
basis: SDD
operation: Freq
keyword: #pfreq=noraman
keyword: PBEPBE/SDD
title: #p freq=noraman PBEPBE/SDD
converged: YES YES NO NO
title: Mulliken charges:
elementType: O O O O O C C C C C C C C C C C C C C C C H H H H H H H H H H H H H H H H
charge: -0.237449 -0.259863 -0.278829 -0.249001 -0.199591 0.226692 -0.047680 0.407497 -0.225617 -0.337077 -0.708875 -0.686035 -0.100921 -0.065236 0.397350 0.054148 -0.266509 -0.326766 0.124669 -0.526369 -0.515694 0.235906 0.263292 0.242280 0.204204 0.237545 0.241643 0.239760 0.214501 0.272827 0.251503 0.240050 0.228811 0.229779 0.211227 0.234025 0.273804
chargesum: 0.00000
title: Mulliken charges with hydrogens summed into heavy atoms:
elementType: O O O O O C C C C C C C C C C C C C C C C
charge: -0.237449 -0.259863 -0.278829 -0.249001 -0.199591 0.226692 -0.047680 0.407497 0.010289 -0.073785 -0.024845 0.009869 -0.100921 -0.065236 0.397350 0.054148 0.006318 -0.075262 0.124669 0.172271 0.203361
polarizability: 3.37476040e+02 -4.41373371e+00 2.10210509e+02 5.66306359e+00 1.20998242e+00 1.06736496e+02
1716.lowfreq: -4.7178 -2.9780 0.0009 0.0010 0.0012 6.4008 35.5263 52.0345 55.7051
frequency: 35.4845 52.0293 55.6993 69.7268 81.1446 93.4261 117.1781 148.5731 155.4948 157.8916 171.4814 187.6879 192.6674 229.4948 248.6270 255.9211 271.3893 276.2521 306.4916 309.5609 351.6382 364.9617 384.6650 408.1736 417.9452 445.7018 464.9470 472.6673 541.9689 545.7685 565.8010 601.4682 618.8114 640.4684 667.2680 683.0082 691.3859 714.6134 755.4260 765.1113 820.8155 825.6395 862.5972 869.7730 901.6554 905.2256 919.4058 944.7206 953.4259 972.4630 992.7161 996.9968 1022.5948 1053.7247 1091.3660 1109.2972 1110.0379 1115.1977 1127.5616 1148.5575 1156.9052 1176.2388 1195.1937 1218.7766 1235.4034 1269.8225 1310.6445 1362.3752 1373.7091 1381.4972 1393.9043 1397.8810 1416.9608 1431.0708 1438.0457 1449.3326 1450.7592 1456.9545 1458.2192 1459.3023 1468.3615 1475.0591 1480.2474 1481.8112 1549.9790 1581.9537 1603.5178 1648.6730 1689.0822 2961.9362 2983.2527 2986.7753 2996.5155 3051.4970 3086.6208 3095.5042 3096.7982 3098.2151 3108.1752 3120.9476 3132.1053 3134.7253 3151.7634 3165.7414 3188.2926
redmass: 3.8610 3.2883 2.6436 3.2243 3.1103 4.6625 4.2055 3.5091 3.2782 1.0883 1.7299 1.1168 4.2396 1.1253 3.3054 4.0805 3.8683 4.2144 5.5293 4.6746 3.3968 4.9730 3.8962 4.3865 4.4588 6.7105 5.3924 4.6932 7.3843 4.4930 5.0374 7.6368 7.1304 4.5714 6.0652 3.8677 7.9465 7.7925 1.9498 8.4808 2.4805 2.3829 4.7324 4.4812 6.4979 4.5978 1.6588 1.9048 6.6377 1.3057 1.3198 1.3154 5.2103 4.1746 2.3980 1.2520 1.2334 3.5869 2.1363 1.4003 1.5541 1.8198 1.6226 2.3977 2.2228 3.6007 2.5776 1.7993 1.2378 3.2391 1.3551 5.6791 3.0851 1.5868 1.7001 1.0898 1.8113 1.0732 1.0593 1.0518 1.0915 1.0781 1.0555 1.0580 9.6574 9.4446 7.7123 7.7983 11.0746 1.0312 1.0338 1.0347 1.0355 1.1044 1.0995 1.0986 1.1007 1.1003 1.1009 1.1013 1.0869 1.1052 1.0893 1.0980 1.0959
irintensity: 1.4454 0.5051 7.8274 1.7429 0.5156 4.2812 4.1300 1.5500 4.3551 0.0576 1.9306 0.1916 2.4113 0.4067 2.1813 2.1461 2.4774 1.2477 1.7736 5.0846 3.1762 9.7414 2.0782 3.0819 5.4839 2.2171 4.1450 11.2953 1.3000 7.0268 3.3970 2.9098 5.0068 4.3776 28.9190 9.4598 15.6236 2.2117 48.6771 19.7323 3.8348 41.4453 14.2380 5.1911 25.4314 10.4626 1.6640 12.7014 136.8646 2.6535 1.5386 1.3442 172.3434 21.0643 9.9610 10.5830 5.8997 232.7714 122.0107 11.6293 13.6677 19.0438 101.3136 23.9017 30.7167 20.3457 43.4079 20.5122 28.7175 225.7766 24.2741 5.1126 27.5251 9.8515 23.1088 9.3569 52.5347 10.7745 15.9790 4.6537 11.6524 2.1183 15.0357 19.4382 73.5866 155.6046 276.7963 47.3443 612.8551 55.9958 72.3205 14.2162 24.7186 33.0570 12.1476 30.4197 21.1641 21.9324 24.0972 27.1179 2.6920 12.7201 4.2945 16.4653 2.1646
temp: 298.150 k
press: 1.00000 atm
elementType: 8 8 8 8 8 6 6 6 6 6 6 6 6 6 6 6 6 6 6 6 6 1 1 1 1 1 1 1 1 1 1 1 1 1 1 1 1
symmnumber: 1
zpe: 745466.9 jmol-1
zpe.correction: 0.283933 hartree
zpe.thermalcorrener: 0.304301 hartree
zpe.thermalcorrenthalpy: 0.305245 hartree
zpe.thermalcorrgfe: 0.235271 hartree
zpe.sumelectzpe: -993.841282 hartree
zpe.sumelectthermal: -993.820915 hartree
zpe.sumelectthermalent: -993.819970 hartree
zpe.sumelectthermalfe: -993.889944 hartree
dipole: -4.8043 4.2787 -2.2556
dipole: 6.8173
quadrupole: -125.1481 -114.8060 -121.0900
quadrupole: 12.7516 -4.1458 -1.9116
quadrupole: -4.8001 5.5420 -0.7419 12.7516 -4.1458 -1.9116
hfenergy: -994.1252158 hartree
pointgroup: C01 [X(C16H16O5)]
dipole: -1.8176195 -1.7805937 0.8483256 debye
polarizability: 336.7603103|8.9486593|210.3764465|-9.6765922|5.1823116|107.2862884 unknown
InChI: InChI=1S/C16H16O5/c1-16(2)8-7-10-12(18-3)9-5-6-11(17)20-13(9)15(19-4)14(10)21-16/h5-8H,1-4H3
charge 0 multiplicity 1
37 atoms
O  -2.404542 1.040155 0.457248
O  2.363937 1.402711 0.004242
O  0.25145 -3.020292 -0.219176
O  -0.209696 2.607081 0.338792
O  4.647057 1.684281 -0.193195
C  -3.682163 0.355667 -0.001848
C  -1.189604 0.409855 0.231509
C  -1.111137 -1.014905 0.079003
C  -3.563299 -1.153377 0.143321
C  -2.356316 -1.783485 0.14163
C  -4.760998 0.951284 0.916269
C  -3.892207 0.752928 -1.481526
C  0.155634 -1.614793 -0.060589
C  -0.025656 1.228299 0.249497
C  1.342238 -0.827337 -0.10201
C  1.229013 0.588448 0.059695
C  2.651595 -1.379608 -0.344136
C  3.777925 -0.583191 -0.388165
C  3.714927 0.858697 -0.198119
C  0.512935 -3.755179 1.039656
C  0.62369 3.366465 1.300958
H  -4.502153 -1.71658 0.195684
H  -2.284016 -2.8746 0.170118
H  -4.756351 2.051477 0.838012
H  -5.758751 0.57997 0.620952
H  -4.575121 0.672948 1.967073
H  -3.93826 1.851989 -1.574645
H  -3.063828 0.376644 -2.106393
H  -4.835315 0.322136 -1.864452
H  2.728271 -2.45695 -0.523335
H  4.772056 -0.994026 -0.579442
H  0.582131 -4.815727 0.754084
H  -0.315163 -3.608124 1.759417
H  1.46185 -3.424252 1.503855
H  0.529298 2.934489 2.315286
H  0.201327 4.382193 1.28566
H  1.679142 3.377509 0.987274
