program: Gaussian 09
title: 000155141
version: EM64L-G09RevD.01
frameworkgroup: C1[X(C12H7Cl3O2)]
method: RPBEPBE
basis: SDD
operation: Freq
keyword: #p
keyword: freq=noraman
keyword: PBEPBE/SDD
title: #p freq=noraman PBEPBE/SDD
converged: NO YES NO NO
title: Mulliken charges:
elementType: Cl Cl Cl O O C C C C C C C C C C C C H H H H H H H
charge: 0.006750 0.006748 -0.026211 -0.279709 -0.434766 0.517176 0.377490 -0.238655 -0.238657 -0.295297 -0.348364 -0.228573 -0.228569 -0.094162 -0.341973 -0.347645 0.279847 0.251039 0.258252 0.286498 0.286498 0.253890 0.224781 0.353612
chargesum: 0.00000
title: Mulliken charges with hydrogens summed into heavy atoms:
elementType: Cl Cl Cl O O C C C C C C C C C C C C
charge: 0.006750 0.006748 -0.026211 -0.279709 -0.081155 0.517176 0.377490 -0.238655 -0.238657 -0.044258 -0.090111 0.057925 0.057929 -0.094162 -0.088083 -0.122863 0.279847
polarizability: 2.41628304e+02 -1.79544176e-03 1.40710644e+02 2.04452618e+01 -2.37171035e-03 1.15440258e+02
1716.lowfreq: 0.0006 0.0016 0.0019 4.5512 8.4835 9.7811 11.5286 30.1147 35.0544
frequency: 10.7233 30.1068 35.0533 92.0291 119.3700 143.8006 168.9794 174.2870 196.5718 242.8977 259.6265 313.7333 326.0242 347.2192 349.3242 387.0249 408.0878 412.8130 432.5507 493.9064 501.3829 505.6548 540.9235 567.7218 620.3681 654.1196 697.4792 737.8257 747.2472 758.4514 798.1772 810.0966 820.9070 852.9052 860.3142 860.4623 923.4336 943.9279 996.8538 1049.1003 1099.8618 1106.4473 1142.4585 1156.6814 1176.2583 1180.5408 1230.8657 1253.2280 1304.0982 1344.0454 1370.9611 1393.2496 1422.9863 1429.4414 1492.7539 1554.6329 1571.9068 1602.3076 1633.0850 3124.4628 3150.3769 3173.0498 3177.4044 3187.2572 3188.6553 3586.6298
redmass: 11.8168 3.9830 14.1511 12.6734 7.1893 10.7013 15.8749 22.9324 4.9264 8.7462 12.2454 8.9332 1.1205 7.2712 32.4267 4.6142 7.9286 2.9897 8.9040 7.9617 2.4644 5.0100 7.3101 4.1897 6.8467 6.3762 3.7095 9.8405 8.0913 11.0033 1.2891 6.9571 1.5819 1.4158 1.3630 7.1175 1.3435 1.3441 2.8102 3.3044 1.3660 2.9578 1.3958 1.7362 1.5137 1.4957 3.1063 3.6571 1.3368 5.8441 4.6474 5.7931 3.7250 3.1757 2.6597 9.6315 8.2446 7.0083 6.7720 1.0902 1.0889 1.0949 1.0963 1.0932 1.0940 1.0661
irintensity: 0.5063 1.2929 0.1476 0.0993 0.0000 0.2512 0.9032 0.2794 0.0028 3.2052 0.5905 0.6483 141.9672 0.6841 0.1326 8.4415 4.6957 1.2747 11.7531 1.3915 23.7392 0.1550 5.6612 14.6033 3.5289 2.8921 2.0113 64.7016 58.8272 71.8412 12.3220 4.0277 72.6837 42.7678 0.0018 3.0769 0.3220 0.4748 14.2624 18.4799 37.8020 73.2918 279.6707 22.8561 59.4627 5.6186 192.6737 19.2980 16.6807 16.1892 25.0554 7.4492 285.1377 62.3468 212.2380 69.4184 46.8481 0.8473 1.3811 20.3034 8.5011 4.6748 0.9299 2.7982 0.7893 44.7131
temp: 298.150 k
press: 1.00000 atm
elementType: 17 17 17 8 8 6 6 6 6 6 6 6 6 6 6 6 6 1 1 1 1 1 1 1
symmnumber: 1
zpe: 408196.5 jmol-1
zpe.correction: 0.155474 hartree
zpe.thermalcorrener: 0.171069 hartree
zpe.thermalcorrenthalpy: 0.172013 hartree
zpe.thermalcorrgfe: 0.109365 hartree
zpe.sumelectzpe: -1990.881535 hartree
zpe.sumelectthermal: -1990.865940 hartree
zpe.sumelectthermalent: -1990.864996 hartree
zpe.sumelectthermalfe: -1990.927644 hartree
dipole: -1.0972 0.0003 -0.2448
dipole: 1.1242
quadrupole: -101.2715 -119.7936 -120.5942
quadrupole: -0.0026 8.3196 -0.0001
quadrupole: 12.6149 -5.9072 -6.7078 -0.0026 8.3196 -0.0001
hfenergy: -1991.0370091 hartree
pointgroup: C01 [X(C12H7Cl3O2)]
dipole: -0.4288928 -0.0001252 0.1079969 debye
dipolederiv: -0.2015753 0.229402 0.0786487 0.2281591 -0.5734662 -0.1235621 0.0696726 -0.1097302 -0.0576227 -0.2015847 -0.2294547 0.0785462 -0.2282015 -0.5735593 0.1233198 0.0695731 0.1094894 -0.0575145 -0.7754797 -0.0000463 0.2551511 -0.0000605 -0.1266496 0.0000028 0.3136675 0.000002 -0.1586122 -2.1832951 0.0000848 -0.1311378 0.000072 -0.2221486 0.0000286 -0.0376588 0.0000319 -0.3456241 -1.3519971 0.0001845 -0.5146248 0.0002422 -0.419205 -0.0000545 -0.6505987 -0.0000635 -0.3092545 1.2211598 -0.000025 -0.0539922 0.0001207 -0.3037525 -0.0000786 -0.6061932 -0.0000704 0.0776658 1.5814613 -0.0001311 0.3715726 -0.0002363 0.0871853 -0.0000114 0.7291804 -0.0000197 0.1151403 0.223433 -0.3172561 -0.1953275 -0.3106451 0.8881889 0.1827326 -0.101115 0.1388566 0.0283898 0.2234484 0.3173747 -0.1951859 0.3107066 0.8883214 -0.1823283 -0.100986 -0.1384593 0.0282424 -0.1554586 -0.0000271 0.0907241 0.0000798 -0.1344546 -0.0000444 -0.2763841 -0.0000387 0.0105496 -0.1832936 0.0000602 -0.1996649 -0.0000139 -0.1310556 -0.0000558 0.0584702 -0.0000599 0.0699025 -0.4265553 0.1252543 0.1238511 0.1061979 -0.2395393 -0.0639119 0.1356246 -0.0550147 -0.1192257 -0.426569 -0.1253062 0.1237955 -0.1062559 -0.2395867 0.0638519 0.1355775 0.0549569 -0.1191702 1.1328771 0.0000884 -0.4513005 0.0001039 0.2744049 0.0000401 -0.50784 0.0000396 0.133512 -0.1985462 0.0000666 -0.2317719 -0.0000569 -0.1464008 -0.0000762 0.136592 -0.0000743 0.0949704 -0.0948007 -0.0000126 0.0370016 0.0001076 -0.1892592 -0.0000426 -0.3461111 -0.0000428 -0.0407398 1.2355215 -0.0001674 0.5270355 -0.0001818 0.0563483 -0.0000301 0.6053906 -0.0000273 0.1746454 -0.0181528 -0.0000191 0.0730832 -0.0000307 0.1322872 0.0000209 0.1231435 0.0000167 0.0668041 0.1228242 0.0000072 -0.0245088 0.0000044 0.1594317 0.0000608 -0.0235577 0.0000589 -0.0395017 0.0864949 -0.0260304 0.0274067 -0.0276826 0.0498709 0.01173 0.0352811 0.012721 0.1598783 0.0864961 0.0260171 0.0274178 0.0276654 0.0498805 -0.0117808 0.0352948 -0.0127727 0.1598665 0.0787577 0.000005 -0.0113514 0.0000122 0.1649624 0.0000608 -0.0314806 0.0000618 -0.0478612 -0.1205729 -0.0000214 0.0803036 -0.0000176 0.1678923 0.000035 0.0599979 0.0000345 0.0491315 0.3454069 -0.0000472 0.114328 -0.0000892 0.3803035 0.0000936 0.1744593 0.0001042 0.1264282 unknown
polarizability: 240.4262531|0.0036295|140.710644|-23.837959|0.00297|116.6423094 unknown
InChI: InChI=1S/C12H7Cl3O2/c13-7-5-10(14)12(11(15)6-7)17-9-3-1-8(16)2-4-9/h1-6,16H
charge 0 multiplicity 1
24 atoms
Cl 0.907466 2.779324 0.69702
Cl 0.907377 -2.77962 0.695746
Cl 5.314749 0.000217 -1.214634
O  -0.168548 -0.000278 1.295938
O  -5.094745 0.000576 -1.456148
C  1.056037 -0.000134 0.620904
C  -1.3883 -0.000048 0.548082
C  1.730769 1.212538 0.330958
C  1.730732 -1.212694 0.330406
C  -1.439361 0.000368 -0.86255
C  -2.565808 -0.000269 1.320946
C  3.023091 1.233923 -0.228184
C  3.023053 -1.233863 -0.228745
C  3.645506 0.000081 -0.497943
C  -2.693687 0.000571 -1.506546
C  -3.81849 -0.000067 0.674023
C  -3.881117 0.000358 -0.74145
H  -0.521188 0.000529 -1.458602
H  -2.489993 -0.000595 2.411765
H  3.52364 2.181283 -0.44002
H  3.523573 -2.181142 -0.441015
H  -2.766035 0.000889 -2.59775
H  -4.737866 -0.000239 1.273153
H  -5.867555 0.000292 -0.838855
