program: Gaussian 09
title: 000155133
version: EM64L-G09RevD.01
frameworkgroup: C1[X(C5H10N2O)]
method: RPBEPBE
basis: SDD
operation: Freq
keyword: #p
keyword: freq=noraman
keyword: PBEPBE/SDD
title: #p freq=noraman PBEPBE/SDD
converged: YES YES NO NO
title: Mulliken charges:
elementType: O N N C C C C C H H H H H H H H H H
charge: -0.460252 -0.131454 -0.093365 -0.346773 -0.333401 -0.486932 -0.184820 -0.287674 0.211965 0.248832 0.222169 0.199591 0.225400 0.226930 0.244362 0.191200 0.204080 0.350141
chargesum: 0.00000
title: Mulliken charges with hydrogens summed into heavy atoms:
elementType: O N N C C C C C
charge: -0.110111 -0.131454 -0.093365 0.114024 0.088359 -0.034601 0.059542 0.107606
polarizability: 8.77049009e+01 3.11434295e+00 7.03623621e+01 -1.51902158e+00 2.57205974e-01 5.02509102e+01
1716.lowfreq: -11.7267 -0.0009 -0.0008 0.0002 3.2918 16.1755 48.2420 108.6598 117.9349
frequency: 48.2268 108.6305 117.9163 153.4351 261.2796 284.5053 332.8534 455.6330 485.7925 598.9438 747.3672 813.9275 846.2846 886.0295 896.8104 908.8072 935.0482 957.7307 1024.2789 1057.2848 1081.9209 1148.6998 1168.1883 1193.1003 1205.1974 1228.8852 1241.6361 1276.7665 1283.8943 1314.2555 1365.6860 1385.9179 1403.5093 1439.1698 1467.2107 1468.6669 1498.2668 1573.7317 2935.0323 2942.6280 2955.4929 2999.0658 3009.9698 3038.3825 3056.8354 3082.8963 3160.0136 3574.4141
redmass: 4.2966 2.4895 4.3066 2.2168 1.1499 4.5585 1.9145 2.3242 2.6082 3.1885 3.8985 1.5528 2.7337 3.7683 1.5691 3.2190 2.7539 2.3408 3.2386 1.8380 1.6782 1.6889 1.1709 1.2432 1.1293 1.7695 1.3706 1.2505 1.2899 1.5548 1.3154 2.0068 1.4832 1.0988 1.0957 1.0960 1.0954 5.5875 1.0659 1.0583 1.0706 1.0635 1.1047 1.0940 1.0997 1.0964 1.0958 1.0665
irintensity: 2.6668 3.4874 7.7074 1.4691 154.2279 8.2310 11.0717 15.4479 29.1945 4.5112 3.5461 9.9695 16.2508 7.1214 15.1265 26.1483 3.7793 4.9421 82.3584 16.6739 2.0831 55.9749 8.1706 49.3441 2.3127 8.0596 56.0006 3.5100 26.9352 16.0186 17.0092 38.7946 5.7066 18.7817 7.9774 1.1963 4.7992 178.5760 46.0718 91.7650 53.4559 56.4160 77.2630 28.6992 27.1193 35.4704 15.2396 4.2675
temp: 298.150 k
press: 1.00000 atm
elementType: 8 7 7 6 6 6 6 6 1 1 1 1 1 1 1 1 1 1
symmnumber: 1
zpe: 397281.1 jmol-1
zpe.correction: 0.151316 hartree
zpe.thermalcorrener: 0.159757 hartree
zpe.thermalcorrenthalpy: 0.160701 hartree
zpe.thermalcorrgfe: 0.117598 hartree
zpe.sumelectzpe: -380.572153 hartree
zpe.sumelectthermal: -380.563713 hartree
zpe.sumelectthermalent: -380.562769 hartree
zpe.sumelectthermalfe: -380.605871 hartree
dipole: -4.7134 -0.0684 -0.2851
dipole: 4.7225
quadrupole: -52.6056 -44.1592 -48.2698
quadrupole: 5.2382 5.1884 -1.8156
quadrupole: -4.2608 4.1857 0.0751 5.2382 5.1884 -1.8156
hfenergy: -380.7234697 hartree
pointgroup: C01 [X(C5H10N2O1)]
dipole: 1.8510943 0.0712685 0.142939 debye
dipolederiv: -0.4103582 -0.1057086 0.189959 -0.1480797 -0.7636342 -0.0743857 0.2179704 -0.0363374 -0.3902561 -1.2706054 0.081153 0.056978 -0.4250285 -0.4552767 0.0640691 -0.1337306 -0.0053978 -0.3395269 -1.0115968 0.0390936 0.0657243 0.1639256 -0.3322144 -0.0004234 0.059619 0.0116023 -0.3887945 -0.0711559 -0.0460287 0.0716741 0.0007277 0.2896352 -0.0663602 0.0848446 -0.0644355 0.3345152 0.7625157 -0.1288827 -0.1535605 -0.1639676 0.1498601 -0.0144232 -0.1379835 -0.0319556 0.3404281 0.1489287 -0.1094285 0.0093402 -0.1340273 0.1974488 0.0060582 0.0085767 0.0142829 0.2830221 1.4046269 0.1170789 -0.1128656 0.4272692 0.3437504 -0.0254413 -0.0258487 -0.008727 -0.0345143 0.2504942 0.0918103 -0.0681704 0.0867417 0.6658301 0.0439078 -0.1034985 0.0478657 0.2829131 0.063054 -0.0328082 0.0639278 -0.0326594 -0.0151707 0.0578974 0.0678023 0.1401794 -0.1603648 0.0700951 -0.0885667 -0.0633236 -0.0622656 -0.0185999 -0.049827 -0.0683282 -0.0791061 -0.0137163 -0.0882456 0.0211538 0.0213116 -0.0260541 0.0600545 0.1380573 0.1410199 0.0423563 -0.1509902 0.0210304 -0.0243827 -0.0025969 0.0517431 -0.1441088 -0.0528823 0.0041993 -0.0089645 0.1019332 0.0587595 -0.013795 0.0415673 0.0692105 0.0092348 -0.0661681 0.1045094 -0.1101221 -0.1302251 -0.0205704 0.0694918 -0.0703258 0.1168267 -0.0164368 0.0534411 -0.1047045 0.1133665 0.00628 0.0730154 0.0853894 0.0137731 0.038876 -0.0947933 -0.0205836 -0.0021659 -0.0307836 0.1523799 -0.2124787 0.1212951 0.0692614 0.0686177 -0.0862641 -0.0402443 0.0914129 -0.0643626 0.0373732 0.0813691 -0.0388866 0.0536465 -0.0373704 -0.062041 0.053187 0.0100816 0.0997183 -0.1657377 0.1511221 -0.0379782 -0.1863208 0.0055146 0.2727261 -0.0058787 -0.213776 -0.0291792 0.235281 unknown
polarizability: 88.0596288|-1.7575485|69.646325|-1.438958|2.7646269|50.6122193 unknown
InChI: InChI=1S/C5H10N2O/c8-4-3-7-2-1-6-5-7/h5,8H,1-4H2
charge 0 multiplicity 1
18 atoms
O  2.514994 1.137335 0.171789
N  -0.091426 -0.33763 -0.17227
N  -2.392545 -0.614299 -0.000649
C  -0.58831 1.06962 -0.204339
C  1.220997 -0.716489 -0.693365
C  -2.114028 0.868436 0.109571
C  -1.213784 -1.176492 -0.153462
C  2.391873 -0.330501 0.219512
H  -0.410749 1.507516 -1.209478
H  -0.059968 1.692713 0.533568
H  1.400019 -0.254241 -1.68983
H  1.235463 -1.815095 -0.828202
H  -2.361095 1.194953 1.13739
H  -2.769547 1.421552 -0.585038
H  -1.080935 -2.259266 -0.239154
H  3.319337 -0.812535 -0.159908
H  2.190217 -0.683224 1.251997
H  3.248289 1.429344 0.768769
