program: Gaussian 09
title: 000155115
version: EM64L-G09RevD.01
frameworkgroup: C1[X(C10H12F3NO2S2)]
method: RPBEPBE
basis: SDD
operation: Freq
keyword: #p
keyword: freq=noraman
keyword: PBEPBE/SDD
title: #p freq=noraman PBEPBE/SDD
converged: YES YES NO NO
title: Mulliken charges:
elementType: S S F F F O O N C C C C C C C C C C H H H H H H H H H H H H
charge: 0.966367 0.233088 -0.157837 -0.149040 -0.173815 -0.514490 -0.529048 -0.525989 0.232868 0.178671 -0.258852 -0.255314 -0.212099 -0.231731 0.225717 -0.737989 -0.606317 -0.658539 0.303250 0.275565 0.263852 0.253038 0.274340 0.286269 0.281241 0.270576 0.266392 0.234144 0.236002 0.229681
chargesum: 0.00000
title: Mulliken charges with hydrogens summed into heavy atoms:
elementType: S S F F F O O N C C C C C C C C C C
charge: 0.966367 0.233088 -0.157837 -0.149040 -0.173815 -0.514490 -0.529048 -0.222738 0.232868 0.178671 0.016713 0.008538 -0.212099 0.021306 0.225717 0.103861 -0.069349 0.041289
polarizability: 3.73880869e+02 -2.94231128e+00 1.60327043e+02 1.96156491e+00 6.79309205e+00 1.10626407e+02
1716.lowfreq: -7.4797 -1.5690 0.0011 0.0011 0.0020 3.7684 17.2409 19.2487 30.7042
frequency: 16.8383 18.8750 30.6396 43.0974 48.6075 85.2946 89.6420 119.0903 125.5021 132.7113 141.1941 158.0976 190.1230 203.8329 232.1701 243.3305 254.2027 271.5432 297.1079 312.9560 334.6898 345.1640 364.3724 390.1493 419.2446 433.5808 453.1124 510.8761 541.3086 584.7380 594.0637 612.4608 632.3964 649.1026 718.3288 739.1654 799.7011 805.2294 826.3560 834.9097 844.7014 883.0717 897.2773 960.8568 965.9538 977.4126 995.3156 1006.2656 1012.7626 1022.2955 1035.5360 1069.2725 1093.7386 1128.9878 1204.1616 1246.1012 1249.9279 1271.8061 1282.2628 1308.2791 1315.9437 1384.8493 1401.3221 1413.0157 1417.9606 1420.9559 1456.0864 1468.7309 1471.1285 1482.0116 1545.5845 1600.1355 2992.6878 3016.5146 3037.5198 3082.1901 3088.3476 3107.8808 3147.4452 3180.5506 3182.8721 3187.0759 3196.6723 3357.2894
redmass: 4.5204 6.1078 15.4233 8.6049 8.4064 4.6217 1.9746 6.8050 5.0680 4.7313 2.6662 1.4289 5.4602 7.6358 1.1360 4.5410 5.6199 5.8853 6.8846 8.3336 9.4349 7.0786 6.2246 6.5622 6.7342 8.6709 6.2805 4.4657 5.7253 8.1791 5.6831 9.9026 5.1178 7.6828 6.3853 4.9590 1.1181 9.6979 1.5688 2.4872 2.2665 1.4734 2.5296 1.6194 3.9517 1.3070 1.8720 4.9079 3.0869 2.9479 1.2088 2.3173 2.8454 1.7576 1.4700 3.3104 1.2282 1.5705 1.5872 1.1911 1.3703 3.5100 1.2050 1.0627 1.0758 4.2509 1.2098 2.1359 1.0383 1.0475 6.0647 6.1643 1.0355 1.0565 1.0249 1.1049 1.0991 1.1054 1.0904 1.0906 1.1072 1.0955 1.1074 1.0748
irintensity: 2.2107 5.0471 0.2261 0.1871 0.3609 0.7087 1.5535 16.1686 10.9833 2.6424 7.4239 5.8767 2.2047 33.1499 0.3168 4.2498 1.5512 6.5878 0.6684 48.9156 1.2192 4.3574 33.0849 16.0582 18.8041 0.8417 10.6013 11.6935 3.9661 65.1328 6.6332 9.7360 1.3193 29.8258 16.4645 6.1802 13.4321 46.8812 59.2504 14.0672 57.5828 30.7493 22.4871 34.6093 172.1330 55.2188 35.8017 69.9931 42.8930 61.8553 0.4493 0.2909 155.1743 24.6988 38.8734 50.7189 0.8852 117.4340 110.4515 2.8801 28.6861 5.0183 22.7066 11.0656 11.1549 10.0153 45.3107 18.6204 16.8017 8.9622 7.9026 185.3017 35.1873 12.2917 0.1552 0.1542 19.6543 36.5718 4.0683 0.7008 0.3875 1.3716 0.3770 24.9080
temp: 298.150 k
press: 1.00000 atm
elementType: 16 16 9 9 9 8 8 7 6 6 6 6 6 6 6 6 6 6 1 1 1 1 1 1 1 1 1 1 1 1
symmnumber: 1
zpe: 544388.0 jmol-1
zpe.correction: 0.207346 hartree
zpe.thermalcorrener: 0.227944 hartree
zpe.thermalcorrenthalpy: 0.228888 hartree
zpe.thermalcorrgfe: 0.154660 hartree
zpe.sumelectzpe: -1687.577160 hartree
zpe.sumelectthermal: -1687.556562 hartree
zpe.sumelectthermalent: -1687.555618 hartree
zpe.sumelectthermalfe: -1687.629846 hartree
dipole: -2.8282 -1.3191 -3.5236
dipole: 4.7069
quadrupole: -90.4665 -126.7761 -128.5668
quadrupole: -9.5663 -18.0434 4.3361
quadrupole: 24.8033 -11.5063 -13.2970 -9.5663 -18.0434 4.3361
hfenergy: -1687.7845062 hartree
pointgroup: C01 [X(C10H12F3N1O2S2)]
dipole: 1.2487417 0.3685602 -1.3168309 debye
polarizability: 368.7779566|-30.7384604|164.9597953|11.7232229|-8.1003789|111.096566 unknown
InChI: InChI=1S/C10H12F3NO2S2/c1-3-17-7-4-5-9(14-18(2,15)16)8(6-7)10(11,12)13/h4-6,14H,3H2,1-2H3
charge 0 multiplicity 1
30 atoms
S  -3.182472 1.613179 0.488873
S  4.002862 1.37794 0.386239
F  0.552347 -2.714507 0.38753
F  -1.390325 -1.737953 1.031425
F  -1.014432 -2.158948 -1.159325
O  -3.981048 0.58642 1.475582
O  -2.359544 2.883528 1.094822
N  -1.909366 0.69732 -0.882873
C  -0.551545 0.76981 -0.519766
C  0.251923 -0.350063 -0.111901
C  1.62807 -0.20151 0.147871
C  0.088368 2.043925 -0.597447
C  2.239902 1.07191 0.062052
C  1.448764 2.19605 -0.304145
C  -0.369499 -1.708247 0.041101
C  -4.428599 2.276906 -0.78688
C  4.663627 -0.339086 0.849805
C  6.162169 -0.210418 1.157009
H  -2.28382 -0.272469 -0.885622
H  2.204541 -1.08725 0.423429
H  -0.511744 2.906936 -0.895198
H  1.907547 3.188417 -0.367829
H  -4.909996 1.401791 -1.243462
H  -5.137463 2.892918 -0.216116
H  -3.84319 2.857035 -1.5107
H  4.102439 -0.694126 1.730687
H  4.486086 -1.016363 -0.002901
H  6.724319 0.159545 0.281776
H  6.343811 0.475288 2.00285
H  6.56877 -1.201277 1.428813
