program: Gaussian 09
title: 000155114
version: EM64L-G09RevD.01
frameworkgroup: C1[X(C11H9Cl4NO3S)]
method: RPBEPBE
basis: SDD
operation: Freq
keyword: #p
keyword: freq=noraman
keyword: PBEPBE/SDD
title: #p freq=noraman PBEPBE/SDD
converged: YES YES NO NO
title: Mulliken charges:
elementType: Cl Cl Cl Cl S O O O N C C C C C C C C C C C H H H H H H H H H
charge: 0.040598 0.016582 0.009649 0.014572 0.279844 -0.427551 -0.217950 -0.277844 -0.388246 -0.105716 -0.684369 -0.076548 0.171414 -0.068382 -0.124530 0.265451 -0.057857 -0.068189 -0.224403 -0.771552 0.305259 0.319678 0.304234 0.348591 0.291314 0.256023 0.256202 0.217357 0.396369
chargesum: 0.00000
title: Mulliken charges with hydrogens summed into heavy atoms:
elementType: Cl Cl Cl Cl S O O O N C C C C C C C C C C C
charge: 0.040598 0.016582 0.009649 0.014572 0.279844 -0.031182 -0.217950 -0.277844 -0.039656 0.199542 -0.060457 -0.076548 0.171414 -0.068382 -0.124530 0.265451 -0.057857 -0.068189 0.066911 -0.041970
polarizability: 2.45010436e+02 -6.63147074e+00 2.21346337e+02 -2.81830641e+01 -9.18806538e+00 1.11458520e+02
1716.lowfreq: -1.5736 -0.0024 -0.0013 0.0014 6.1744 8.1694 16.5948 27.4784 35.7971
frequency: 16.3714 27.4429 35.7937 46.3441 58.2941 62.1954 71.7372 78.5807 87.7710 110.2961 136.7294 149.6581 182.9319 186.6784 198.8589 209.6099 218.5828 239.9607 284.2032 304.5127 322.3295 329.0214 330.2206 352.7532 360.5926 456.1622 501.8829 511.2970 513.9443 522.1358 533.9571 559.0495 586.1964 593.5031 609.3922 612.1750 616.5439 643.1615 711.3498 720.4399 761.2506 804.3286 818.3719 857.3890 903.7475 941.9395 981.7861 993.9157 1010.3585 1044.2330 1081.3216 1137.3658 1152.8489 1154.7091 1188.4061 1225.1605 1247.1601 1288.4760 1298.5909 1317.7253 1329.0919 1329.4819 1367.7712 1390.1031 1418.9426 1450.0984 1462.9123 1480.9572 1539.3511 1540.6364 1606.8417 1669.3792 2962.1044 2999.6911 3064.6344 3099.0850 3105.2385 3148.0967 3187.6610 3526.8545 3567.7235
redmass: 8.3264 8.2277 12.6627 7.7901 11.1575 6.9004 17.7651 3.7815 1.2142 10.3731 5.6896 7.0534 6.8057 11.5550 23.9466 24.0409 21.9700 4.2490 7.1679 26.9303 20.2357 12.0874 3.4896 4.8431 8.6433 3.0858 4.1973 9.5360 4.3097 6.7931 4.7376 1.3961 11.8358 3.0570 2.8468 3.0049 8.3514 2.0051 7.3006 4.7226 9.6657 11.8093 3.5467 1.4211 2.5185 4.5600 2.8850 1.5667 10.6924 1.6549 1.7944 2.0926 1.7091 7.0650 1.5173 1.3315 1.5260 1.7177 8.0861 1.3816 5.9887 2.6544 3.3442 1.2290 1.0851 1.0460 1.2283 1.7601 11.0304 7.9945 6.3118 9.4397 1.0803 1.0359 1.0577 1.0981 1.1009 1.1081 1.0934 1.0644 1.0787
irintensity: 0.5246 0.3612 1.4404 3.9991 6.3256 0.7118 0.8990 7.1400 0.0333 1.4727 5.0164 0.2393 3.1411 1.9512 0.2405 0.2776 1.0764 4.3405 4.0274 0.0401 0.1354 0.2012 2.2329 1.5612 1.3907 15.8524 35.4364 3.0483 45.6748 4.5325 1.5508 30.3937 1.0470 99.8018 4.8367 45.0038 62.1642 131.6558 3.0810 18.8201 34.0199 2.3716 9.9220 19.9220 12.3142 19.5035 61.5045 5.3166 51.3461 14.2253 137.9529 21.1061 38.0861 6.3899 16.0263 1.7680 22.6711 106.0187 37.9853 18.7333 19.6279 9.9745 134.5703 72.3018 30.0162 17.2193 155.0214 230.2813 18.9200 15.2148 147.0035 182.6430 14.1600 8.0904 2.1816 7.8029 16.6505 0.0667 3.3672 35.7613 43.6406
temp: 298.150 k
press: 1.00000 atm
elementType: 17 17 17 17 16 8 8 8 7 6 6 6 6 6 6 6 6 6 6 6 1 1 1 1 1 1 1 1 1
symmnumber: 1
zpe: 481786.4 jmol-1
zpe.correction: 0.183503 hartree
zpe.thermalcorrener: 0.205281 hartree
zpe.thermalcorrenthalpy: 0.206225 hartree
zpe.thermalcorrgfe: 0.128743 hartree
zpe.sumelectzpe: -2941.821443 hartree
zpe.sumelectthermal: -2941.799665 hartree
zpe.sumelectthermalent: -2941.798721 hartree
zpe.sumelectthermalfe: -2941.876203 hartree
dipole: 0.6583 3.4573 -0.1572
dipole: 3.5229
quadrupole: -144.4372 -152.3137 -153.4205
quadrupole: 14.0284 -4.7899 2.8337
quadrupole: 5.6199 -2.2566 -3.3633 14.0284 -4.7899 2.8337
hfenergy: -2942.004946 hartree
pointgroup: C01 [X(C11H9Cl4N1O3S1)]
dipole: 0.3669906 -1.0187473 0.8651605 debye
polarizability: 231.787015|35.2202184|184.7735044|33.3198877|-48.5888508|161.2547744 unknown
InChI: InChI=1S/C11H9Cl4NO3S/c1-4(17)16-7(11(18)19)3-20-10-8(14)5(12)2-6(13)9(10)15/h2,7,16,18H,3H2,1H3
charge 0 multiplicity 1
29 atoms
Cl -1.871737 2.579207 -1.443955
Cl -0.754495 -1.445406 2.293714
Cl -3.568389 -2.849699 1.539512
Cl -4.634525 1.059542 -2.173229
S  0.150564 1.324372 0.830989
O  2.218572 -2.037398 0.40259
O  0.702742 -1.672557 -1.320446
O  4.256583 2.057538 -0.884129
N  3.239074 0.385357 0.350594
C  2.260171 0.129016 -0.707619
C  1.152072 1.208344 -0.787766
C  -1.410389 0.479297 0.356816
C  1.635068 -1.260363 -0.601644
C  -2.289733 1.029865 -0.616908
C  -1.811963 -0.709604 1.026595
C  4.214633 1.354433 0.174244
C  -3.03981 -1.332404 0.711827
C  -3.507632 0.387788 -0.931267
C  -3.888279 -0.793586 -0.270716
C  5.208457 1.518477 1.315668
H  2.792517 0.184297 -1.68265
H  1.618894 2.193881 -0.934693
H  0.458134 0.994144 -1.613326
H  3.225098 -0.218575 1.17361
H  -4.83293 -1.284051 -0.515537
H  6.231556 1.39709 0.920716
H  5.133966 2.544217 1.716372
H  5.053702 0.80167 2.139906
H  1.747779 -2.911595 0.467531
