program: Gaussian 09
title: 000155112
version: EM64L-G09RevD.01
frameworkgroup: C1[X(C14H22O5)]
method: RPBEPBE
basis: SDD
operation: Freq
keyword: #pfreq=noraman
keyword: PBEPBE/SDD
title: #p freq=noraman PBEPBE/SDD
converged: NO YES NO NO
title: Mulliken charges:
elementType: O O O O O C C C C C C C C C C C C C C H H H H H H H H H H H H H H H H H H H H H H
charge: -0.309253 -0.292048 -0.280135 -0.287741 -0.304160 -0.103689 0.352630 -0.085783 -0.500618 -0.474395 -0.462105 -0.368919 -0.391774 -0.240886 -0.321063 -0.057568 -0.013389 -0.361789 -0.362927 0.217150 0.221242 0.223015 0.244587 0.221320 0.230971 0.224815 0.224623 0.218564 0.208866 0.214796 0.220184 0.177343 0.210091 0.219710 0.207094 0.249319 0.253383 0.214784 0.227735 0.212972 0.223051
chargesum: 0.00000
title: Mulliken charges with hydrogens summed into heavy atoms:
elementType: O O O O O C C C C C C C C C C C C C C
charge: -0.309253 -0.292048 -0.280135 -0.287741 -0.304160 0.113460 0.352630 0.135459 -0.033016 -0.022104 -0.012668 0.058511 0.043206 0.146548 0.105740 0.191751 0.239994 0.080729 0.073095
polarizability: 1.78884402e+02 -4.94231423e-02 1.63843452e+02 -5.59168945e+00 -6.51849651e-01 1.34912645e+02
1716.lowfreq: -2.4528 -0.0007 -0.0006 -0.0003 10.9318 13.2513 21.4053 31.5859 42.1586
frequency: 21.0723 30.9776 41.7795 46.1791 64.3250 69.3374 83.0797 98.2849 114.0492 141.5317 154.5076 204.4536 217.5400 240.5948 243.6494 255.6038 312.9591 327.6852 343.1470 379.1605 387.6927 393.5198 410.8376 446.2494 452.4603 501.7386 548.2411 559.4153 650.5237 702.8038 710.2654 744.9237 751.5596 783.5874 785.9527 816.3189 840.9279 858.0606 876.1096 879.7102 892.2358 897.4993 919.1852 938.6176 950.0548 954.2047 963.6784 979.3009 1011.1059 1025.9982 1029.4894 1034.5655 1037.4889 1049.3474 1057.8661 1095.7254 1099.5609 1102.8556 1109.8853 1113.3229 1127.7886 1139.8675 1142.9795 1149.7166 1160.7306 1192.6208 1214.1319 1216.6455 1222.5617 1239.8048 1242.6081 1244.3551 1248.3235 1258.4857 1300.4641 1316.2082 1328.1309 1335.8145 1339.7933 1349.9223 1364.1573 1368.8540 1378.5024 1408.7870 1410.1053 1424.3926 1450.3403 1455.5005 1458.0204 1462.0301 1465.8592 1477.0665 1482.5645 1483.4031 1491.2239 2906.4346 2939.5472 2953.8639 2974.8178 2976.2058 2988.3029 2990.4108 2993.8328 3000.1696 3025.5211 3038.8463 3048.1474 3060.3526 3062.9938 3066.2043 3072.3168 3075.3882 3095.5504 3096.9514 3108.5104 3166.2068 3169.5187
redmass: 6.2295 5.6500 5.4422 4.0078 3.8609 3.0363 4.7382 4.2389 3.0759 3.8744 4.3408 3.7515 4.3061 2.7156 3.2130 4.1484 3.1116 3.2479 2.0011 2.5901 2.6944 2.7469 1.9904 4.3323 2.7728 3.5372 3.7854 4.6944 3.3495 5.4867 3.1034 6.2129 3.9823 2.8454 3.8759 3.0115 3.0898 2.5816 2.0100 2.4465 1.5310 1.9337 2.3260 3.5841 1.8963 1.7109 1.6288 2.0193 2.1102 2.5163 1.3134 1.4243 1.8706 4.6695 1.4568 1.5347 1.4822 1.4873 1.4132 1.2956 1.8312 1.6666 1.7760 1.8679 1.7369 1.2425 1.2131 1.2539 1.2476 1.4778 1.2566 1.3760 1.3695 1.5070 1.6464 1.2813 1.5780 1.2960 1.3431 1.6417 1.6075 1.3385 1.4969 1.7346 2.7145 1.7780 1.0978 1.0954 1.0904 1.1070 1.0905 1.0841 1.2266 1.2009 1.0776 1.0606 1.0550 1.0587 1.0674 1.0961 1.0729 1.0915 1.0617 1.0628 1.1045 1.0984 1.0994 1.0528 1.0536 1.1013 1.0975 1.0874 1.0940 1.0931 1.0910 1.1187 1.1182
irintensity: 1.1429 0.3443 1.2184 7.6327 0.1158 2.4627 4.0173 3.1782 3.3975 2.7765 8.8882 3.9153 9.6787 5.5225 3.3364 10.0047 8.6359 8.4743 6.6273 3.0884 0.6050 3.1955 1.8451 3.1772 7.2048 10.4281 2.1972 0.5412 5.4314 11.6588 5.3556 13.2097 8.1558 14.2332 56.3863 26.2040 7.2195 18.3101 5.5925 1.6701 4.6392 7.5251 7.3316 5.9842 1.0339 5.8772 8.8889 10.7112 45.3107 55.8293 1.4816 3.5078 50.7421 176.3969 17.3906 3.0858 0.9725 3.9846 4.7820 20.2700 13.9822 3.0218 0.6913 1.1100 1.7129 1.1110 5.5804 3.1603 3.6624 4.1885 2.6267 5.8558 1.9597 7.6886 1.3046 20.6855 6.6515 14.0952 2.0738 0.6700 3.9681 0.4829 7.4612 0.9224 4.9923 8.7384 16.3788 5.7633 7.1224 8.8434 4.8217 9.2941 1.7241 5.1764 21.0341 58.8552 49.1279 31.4865 92.8290 23.7387 14.2714 52.5541 25.0468 21.6977 30.5417 28.8408 14.7555 24.7842 32.8367 27.6351 12.2553 27.7109 67.7987 18.3439 14.2179 33.4855 28.6525
temp: 298.150 k
press: 1.00000 atm
elementType: 8 8 8 8 8 6 6 6 6 6 6 6 6 6 6 6 6 6 6 1 1 1 1 1 1 1 1 1 1 1 1 1 1 1 1 1 1 1 1 1 1
symmnumber: 1
zpe: 896688.8 jmol-1
zpe.correction: 0.341531 hartree
zpe.thermalcorrener: 0.361204 hartree
zpe.thermalcorrenthalpy: 0.362148 hartree
zpe.thermalcorrgfe: 0.291006 hartree
zpe.sumelectzpe: -921.115813 hartree
zpe.sumelectthermal: -921.096140 hartree
zpe.sumelectthermalent: -921.095196 hartree
zpe.sumelectthermalfe: -921.166338 hartree
dipole: -2.1063 0.7262 3.3207
dipole: 3.9988
quadrupole: -132.0019 -122.0587 -106.3303
quadrupole: -5.3413 -4.3288 6.3104
quadrupole: -11.8716 -1.9284 13.8000 -5.3413 -4.3288 6.3104
hfenergy: -921.4573442 hartree
pointgroup: C01 [X(C14H22O5)]
dipole: -0.8313937 -0.2885381 -1.3041063 debye
polarizability: 178.7279456|-0.5840496|163.7660578|5.9929946|-2.124478|135.1464957 unknown
InChI: InChI=1S/C14H22O5/c1-2-14(3-13-12(1)19-13,8-15-4-10-6-17-10)9-16-5-11-7-18-11/h10-13H,1-9H2
charge 0 multiplicity 1
41 atoms
O  4.671673 -0.183362 -0.020099
O  -0.651201 -0.957774 0.166285
O  0.09171 2.530327 0.041261
O  -2.279253 -3.735612 0.731454
O  -3.723825 2.775902 0.075835
C  3.570241 0.069383 -1.039958
C  1.367837 0.434838 0.273876
C  3.702162 -1.283949 -0.398014
C  2.49251 1.057301 -0.608832
C  1.983136 -0.529315 1.329291
C  2.736005 -1.718551 0.690142
C  0.37695 -0.300202 -0.656692
C  0.614032 1.555459 1.023188
C  -1.642604 -1.664032 -0.647259
C  -1.204159 3.114442 0.413753
C  -2.619987 -2.331287 0.287997
C  -2.33967 2.164687 0.060415
C  -3.458464 -3.482973 -0.174915
C  -3.098331 2.311995 -1.220619
H  3.972278 0.198439 -2.054103
H  4.177025 -2.090135 -0.975923
H  2.039298 1.52813 -1.501131
H  2.985004 1.87422 -0.04702
H  2.687891 0.045904 1.960324
H  1.182363 -0.921492 1.981344
H  2.014004 -2.438815 0.256988
H  3.294692 -2.268471 1.471647
H  -0.102176 0.438999 -1.334544
H  0.903434 -1.059175 -1.274163
H  1.306209 2.081763 1.713023
H  -0.213339 1.112657 1.61141
H  -2.174865 -0.939736 -1.308492
H  -1.153353 -2.428902 -1.288432
H  -1.294588 4.050031 -0.164078
H  -1.231865 3.362558 1.495118
H  -2.994197 -1.697994 1.102998
H  -2.285581 1.167952 0.520392
H  -3.338293 -3.861405 -1.198784
H  -4.44238 -3.647858 0.27985
H  -3.582746 1.438142 -1.674419
H  -2.825476 3.119013 -1.912815
