program: Gaussian 09
title: 000160198
version: EM64L-G09RevD.01
frameworkgroup: C1[X(C8H23N5)]
method: RPBEPBE
basis: SDD
operation: Freq
keyword: #pfreq=noraman
keyword: PBEPBE/SDD
title: #p freq=noraman PBEPBE/SDD
converged: YES YES NO NO
title: Mulliken charges:
elementType: N N N N N C C C C C C C C H H H H H H H H H H H H H H H H H H H H H H H
charge: -0.113005 -0.288807 -0.575964 -0.572403 -0.579937 -0.393061 -0.343934 -0.336863 -0.366883 -0.389443 -0.400744 -0.331113 -0.391705 0.226802 0.177823 0.229696 0.179509 0.192038 0.217851 0.222370 0.181303 0.219880 0.188690 0.201997 0.207667 0.234355 0.195116 0.204796 0.192312 0.205891 0.259250 0.276188 0.275335 0.258347 0.275423 0.261224
chargesum: 0.00000
title: Mulliken charges with hydrogens summed into heavy atoms:
elementType: N N N N N C C C C C C C C
charge: -0.113005 -0.054453 -0.040527 -0.038721 -0.043290 0.011564 0.065271 0.073026 0.036790 0.019126 0.008920 0.068799 0.006498
polarizability: 1.49732043e+02 -2.58413470e+00 1.22751878e+02 -1.67025681e+00 1.44813759e-01 1.05809566e+02
1716.lowfreq: -9.8379 -4.5660 0.0003 0.0004 0.0008 4.8036 24.9406 35.3860 45.4860
frequency: 24.8474 35.3228 45.4426 53.2890 70.2619 82.2723 89.5324 98.1831 126.0681 145.1242 183.7942 198.2530 204.9084 206.0225 239.7653 242.6233 259.5904 327.6264 340.1960 377.1689 433.0210 445.3851 527.2493 538.5011 594.5259 599.2384 602.4408 691.9621 784.8038 794.7596 798.6427 808.8306 850.3823 946.6281 952.9828 957.7346 1014.0451 1036.4116 1038.6576 1057.3079 1067.3078 1068.4863 1093.8465 1097.0223 1110.2667 1112.9829 1127.0947 1146.2258 1162.2189 1201.9242 1218.4255 1242.9791 1246.5643 1249.6462 1271.3237 1279.4038 1281.3611 1291.5934 1293.1073 1308.5900 1337.1493 1344.2841 1347.0755 1375.9431 1383.3787 1389.8543 1398.7122 1448.9009 1465.7026 1466.8887 1471.7419 1480.8627 1485.3856 1489.4686 1490.7758 1495.7934 1636.7962 1641.5925 1642.2021 2835.3950 2850.9331 2855.8966 2882.9652 2892.1741 2902.6394 2912.5993 2916.4562 2983.5904 3005.1735 3013.6980 3022.6796 3032.6433 3037.3884 3049.4870 3057.9711 3413.2041 3458.6755 3463.2483 3464.8135 3586.6381 3590.5224 3592.0619
redmass: 4.3313 3.3788 1.7187 3.3249 3.6484 2.0602 2.2791 2.4648 2.0205 2.6049 1.6021 1.3883 1.4366 1.3741 2.0667 2.1232 2.7981 2.8711 2.8682 2.9903 3.5125 3.1274 3.0125 3.2526 1.3176 1.2931 1.3202 1.2704 1.1354 1.1598 1.1452 1.1457 3.5455 1.7440 1.6973 1.7928 2.5767 2.1852 2.5417 2.5182 1.9020 2.4861 2.2323 2.4385 2.3404 2.3814 1.7160 3.9197 1.3585 1.8923 1.7662 1.3213 1.3370 1.3941 1.3295 1.1300 1.0897 1.1653 1.1920 1.3314 1.3385 1.3345 1.3534 1.4176 1.4212 1.4568 1.4881 1.2177 1.0701 1.0718 1.0946 1.0822 1.0820 1.0864 1.0890 1.0849 1.0949 1.0940 1.0934 1.0715 1.0713 1.0710 1.0712 1.0685 1.0683 1.0672 1.0680 1.0883 1.0899 1.0961 1.0855 1.0940 1.0866 1.0899 1.0922 1.0734 1.0449 1.0451 1.0451 1.0975 1.0976 1.0977
irintensity: 0.0119 0.3938 1.0952 1.9441 0.4659 3.8199 2.6023 2.9193 7.7597 5.4305 5.0406 63.4700 4.7381 33.7750 18.9589 46.6474 2.9261 1.7368 14.1912 7.0876 10.0503 8.6073 9.0811 8.1877 219.3893 270.2968 220.5557 91.2246 5.3601 0.8080 2.1400 4.5189 6.2530 0.4965 2.1779 0.0659 21.0408 6.4198 32.5807 13.0336 27.3521 20.1192 19.3027 32.1552 38.1347 6.1614 2.3858 69.4720 3.9397 3.1338 12.2005 8.3234 0.9479 23.7524 3.2212 7.9125 0.7511 18.6576 3.2872 2.7479 4.4399 1.2178 3.1096 0.8316 1.2505 2.9711 0.3146 33.5905 7.4027 1.3646 6.0323 3.2365 4.3860 6.1054 7.3077 3.6995 46.2518 40.6145 40.4698 84.1486 143.2666 90.6956 114.3452 29.9356 0.6170 160.0806 173.5312 4.6513 7.5774 85.3854 24.1336 52.6780 30.9547 44.8026 60.2844 3.0024 0.9406 0.9022 0.9127 0.3689 0.3290 0.4833
temp: 298.150 k
press: 1.00000 atm
elementType: 7 7 7 7 7 6 6 6 6 6 6 6 6 1 1 1 1 1 1 1 1 1 1 1 1 1 1 1 1 1 1 1 1 1 1 1
symmnumber: 1
zpe: 851188.1 jmol-1
zpe.correction: 0.324200 hartree
zpe.thermalcorrener: 0.342338 hartree
zpe.thermalcorrenthalpy: 0.343283 hartree
zpe.thermalcorrgfe: 0.275877 hartree
zpe.sumelectzpe: -591.218190 hartree
zpe.sumelectthermal: -591.200052 hartree
zpe.sumelectthermalent: -591.199108 hartree
zpe.sumelectthermalfe: -591.266514 hartree
dipole: -1.4865 -0.6930 -0.4324
dipole: 1.6962
quadrupole: -82.7520 -74.6027 -80.0141
quadrupole: 3.8247 -5.6428 -0.8578
quadrupole: -3.6290 4.5202 -0.8912 3.8247 -5.6428 -0.8578
hfenergy: -591.5423908 hartree
pointgroup: C01 [X(C8H23N5)]
dipole: 0.5718379 0.2922355 -0.1814317 debye
polarizability: 149.9252234|-1.5577246|122.5928701|1.0834437|-0.2554597|105.7753938 unknown
InChI: InChI=1S/C8H23N5/c9-1-4-12-5-8-13(6-2-10)7-3-11/h12H,1-11H2
charge 0 multiplicity 1
36 atoms
N  -1.445066 -0.044529 0.266432
N  2.336698 0.286605 0.449539
N  -3.601532 3.041999 -0.230897
N  -2.984595 -3.508326 -0.055335
N  5.975614 0.10782 -0.576397
C  -0.121831 0.393876 0.76523
C  -2.532821 0.933895 0.499878
C  -1.807026 -1.435222 0.635393
C  1.032966 -0.110685 -0.123996
C  -2.54559 2.060826 -0.555318
C  -2.60777 -2.144698 -0.479964
C  3.513573 -0.08476 -0.365418
C  4.8100 0.478011 0.251503
H  -0.084232 1.497702 0.774798
H  0.05335 0.062869 1.822483
H  -3.506419 0.415319 0.449978
H  -2.470214 1.387016 1.522842
H  -0.873459 -2.004407 0.814859
H  -2.399702 -1.488411 1.578353
H  0.930689 0.348659 -1.125026
H  0.937455 -1.216695 -0.270751
H  -2.771276 1.608731 -1.537911
H  -1.521828 2.500911 -0.633126
H  -2.004924 -2.097527 -1.416648
H  -3.538656 -1.577851 -0.671211
H  2.433691 -0.05338 1.418034
H  3.373971 0.349667 -1.376897
H  3.639505 -1.185585 -0.503826
H  4.953912 0.031524 1.256027
H  4.672183 1.574235 0.401096
H  -3.45295 3.536276 0.654819
H  -3.835408 3.684325 -0.993028
H  -3.756406 -3.924484 -0.582709
H  -2.193258 -4.152379 0.038563
H  6.881598 0.216723 -0.112872
H  5.97146 0.52635 -1.511798
