program: Gaussian 09
title: 000155093
version: EM64L-G09RevD.01
frameworkgroup: C1[X(C15H9Cl2NO2)]
method: RPBEPBE
basis: SDD
operation: Freq
keyword: #p
keyword: freq=noraman
keyword: PBEPBE/SDD
title: #p freq=noraman PBEPBE/SDD
converged: YES YES NO NO
title: Mulliken charges:
elementType: Cl Cl O O N C C C C C C C C C C C C C C C H H H H H H H H H
charge: -0.045293 -0.045331 -0.194016 -0.206732 -0.365888 0.382962 -0.614143 0.075449 0.128099 0.066660 0.560987 -0.346232 -0.324027 -0.227332 -0.322258 -0.318492 -0.234050 -0.056799 -0.057624 -0.248828 0.276115 0.272933 0.241447 0.280593 0.279176 0.278613 0.238242 0.241603 0.284164
chargesum: 0.00000
title: Mulliken charges with hydrogens summed into heavy atoms:
elementType: Cl Cl O O N C C C C C C C C C C C C C C C
charge: -0.045293 -0.045331 -0.194016 -0.206732 -0.365888 0.382962 -0.065095 0.075449 0.128099 0.066660 0.560987 -0.104785 -0.043433 0.010911 -0.043082 -0.039879 0.007553 -0.056799 -0.057624 0.035336
polarizability: 2.73822209e+02 -4.75859684e-01 1.83677501e+02 -1.55289510e+00 -1.22486929e+01 1.23938709e+02
1716.lowfreq: -10.6425 -6.4588 -0.0010 0.0022 0.0027 2.2683 15.5536 23.8418 42.2779
frequency: 14.6457 23.8174 42.2436 55.1623 103.9986 127.2533 148.0534 159.5011 199.2674 207.5818 236.1541 245.0349 288.9557 301.8930 374.9467 377.8032 408.4451 417.0400 425.8406 461.5924 470.6089 513.6427 518.7846 534.8761 545.3165 593.2021 625.9156 654.3040 675.4359 690.5566 724.5590 737.9222 757.4408 796.3039 851.6970 861.1904 870.2490 880.4478 885.2963 894.1735 945.1047 980.2180 983.2899 992.8495 1009.0743 1037.6576 1091.8499 1099.9058 1103.2026 1122.4752 1175.5491 1190.1117 1204.6730 1214.7299 1234.8649 1253.8284 1257.9856 1318.5847 1330.3799 1377.3217 1397.0914 1415.4098 1420.9101 1431.5855 1447.4853 1484.0451 1571.4035 1582.9487 1596.3082 1605.0787 1613.9819 1634.1471 2982.7245 3039.8587 3127.9358 3144.8983 3158.8234 3174.0668 3186.6440 3189.0782 3191.8970
redmass: 6.2978 8.3935 4.6867 9.3646 11.2336 4.0427 18.6010 8.0703 4.7275 3.3278 7.7625 5.9348 7.9246 6.3109 12.6615 11.0140 8.9590 3.6660 7.7111 3.1548 4.8016 5.0573 6.3868 7.9902 5.6066 4.3067 5.3697 5.0749 2.8653 4.5176 6.6720 2.0811 9.9273 1.9321 4.3593 1.9070 1.5051 1.4075 1.3855 3.8497 2.3069 6.6024 1.4268 5.8640 1.3411 2.2344 2.0204 2.0488 1.7319 2.6527 1.1011 2.0847 1.4090 2.4100 2.5430 1.2231 2.0537 4.5039 1.7996 10.9725 7.2475 2.8123 1.1267 3.4221 2.5696 2.5605 8.2928 8.4939 7.6929 8.3544 7.5756 10.2864 1.0650 1.0933 1.0879 1.0899 1.0940 1.1000 1.0937 1.0938 1.0944
irintensity: 0.1303 0.0202 5.1397 0.7723 1.4778 4.1313 0.0243 0.4113 0.0639 3.2082 2.4525 3.9108 4.1165 2.1617 24.9770 1.4922 9.0401 2.7633 3.2036 2.3290 2.7550 0.7916 25.3616 3.6122 4.3463 4.5999 2.3204 12.7896 30.6060 6.5196 31.1989 34.7391 102.1549 24.0829 1.9888 37.1850 3.6958 1.6598 3.4653 7.6259 8.4276 12.8170 4.1920 11.2885 0.1518 9.2013 21.1302 3.7459 3.6088 116.7729 10.7039 99.7377 37.9407 7.0318 155.2669 6.9602 35.8620 272.2963 6.8323 0.2082 1.5824 57.7016 21.5780 55.4685 25.8468 1.6633 98.3421 136.3530 75.9849 138.6998 169.3896 83.0124 2.8913 1.0085 3.9208 10.4482 9.3233 21.6977 0.9608 1.4371 0.5796
temp: 298.150 k
press: 1.00000 atm
elementType: 17 17 8 8 7 6 6 6 6 6 6 6 6 6 6 6 6 6 6 6 1 1 1 1 1 1 1 1 1
symmnumber: 1
zpe: 526483.3 jmol-1
zpe.correction: 0.200527 hartree
zpe.thermalcorrener: 0.217284 hartree
zpe.thermalcorrenthalpy: 0.218229 hartree
zpe.thermalcorrgfe: 0.153021 hartree
zpe.sumelectzpe: -1700.968250 hartree
zpe.sumelectthermal: -1700.951493 hartree
zpe.sumelectthermalent: -1700.950549 hartree
zpe.sumelectthermalfe: -1701.015756 hartree
dipole: -5.9150 -0.3936 0.4899
dipole: 5.9483
quadrupole: -103.9979 -134.3993 -131.9538
quadrupole: 3.6393 -2.9006 2.6360
quadrupole: 19.4524 -10.9490 -8.5034 3.6393 -2.9006 2.6360
hfenergy: -1701.1687771 hartree
pointgroup: C01 [X(C15H9Cl2N1O2)]
dipole: -2.3162847 0.3095077 -0.1256358 debye
polarizability: 273.6386423|-3.7794574|182.6770436|3.1543956|14.6456611|125.1227334 unknown
InChI: InChI=1S/C15H9Cl2NO2/c16-10-6-11(17)8-12(7-10)18-14(19)5-9-3-1-2-4-13(9)15(18)20/h1-4,6-8H,5H2
charge 0 multiplicity 1
29 atoms
Cl 4.639763 1.445303 2.116562
Cl 4.17439 -2.389683 -1.873599
O  0.42863 2.526094 -0.741163
O  -0.393476 -1.897009 0.551401
N  0.018139 0.307926 -0.120424
C  -2.837226 0.763437 -0.21954
C  -1.898673 1.852444 -0.685337
C  -2.328548 -0.491085 0.199802
C  -0.404744 1.612985 -0.513033
C  -0.867712 -0.775898 0.226294
C  1.451479 0.0536 -0.039157
C  -4.236624 0.974431 -0.213017
C  -3.212107 -1.522022 0.617038
C  -5.114162 -0.04862 0.202944
C  2.028912 -0.913252 -0.890138
C  2.232911 0.779291 0.885367
C  -4.600894 -1.302994 0.619158
C  3.612914 0.516412 0.936897
C  3.412296 -1.141569 -0.791712
C  4.234536 -0.440624 0.111783
H  -2.04992 2.050906 -1.766294
H  -2.122431 2.812966 -0.184702
H  -4.638672 1.942726 -0.534017
H  -2.779924 -2.476579 0.933319
H  1.41451 -1.47847 -1.593638
H  1.779755 1.532923 1.532317
H  -6.195143 0.128602 0.204592
H  -5.282777 -2.096164 0.942067
H  5.3085 -0.631376 0.170131
