program: Gaussian 09
title: 000160168
version: EM64L-G09RevD.01
frameworkgroup: C1[X(C14H20O2)]
method: RPBEPBE
basis: SDD
operation: Freq
keyword: #pfreq=noraman
keyword: PBEPBE/SDD
title: #p freq=noraman PBEPBE/SDD
converged: YES YES NO NO
title: Mulliken charges:
elementType: O O C C C C C C C C C C C C C C H H H H H H H H H H H H H H H H H H H H
charge: -0.251599 -0.421579 -0.207798 -0.441501 -0.441634 -0.397094 -0.397200 -0.382924 0.555866 -0.459287 -0.407404 -0.370317 -0.380950 0.328918 -0.276301 -0.334224 0.198223 0.215616 0.193170 0.192707 0.215499 0.191745 0.199167 0.199066 0.191814 0.187021 0.199079 0.234027 0.225500 0.250637 0.237001 0.206512 0.199563 0.180740 0.235747 0.332196
chargesum: 0.00000
title: Mulliken charges with hydrogens summed into heavy atoms:
elementType: O O C C C C C C C C C C C C C C
charge: -0.251599 -0.089384 -0.009576 -0.032715 -0.033429 -0.006182 -0.006320 0.003175 0.555866 -0.225261 -0.181903 -0.119680 -0.143949 0.328918 0.129774 0.082264
polarizability: 2.24003193e+02 1.60135510e+00 1.39033933e+02 3.27406813e+00 2.72234738e-01 1.12401110e+02
1716.lowfreq: -13.0495 -6.2139 -0.0008 -0.0008 0.0002 5.4063 19.3060 33.6733 57.9258
frequency: 19.1716 33.6250 57.8886 73.0575 79.2458 126.6925 140.4708 193.3128 203.0095 222.7070 234.9452 256.8606 311.1894 341.7811 390.3089 408.7514 411.6477 430.3344 454.3357 478.2583 494.8891 537.7484 597.3816 631.4611 733.3652 741.9645 778.5814 781.8086 807.7906 826.4114 833.3453 859.0731 863.6449 888.9651 891.1016 900.2566 914.8842 937.5803 962.3091 988.4133 1004.8030 1017.0336 1036.5318 1048.2109 1050.8561 1069.5734 1082.8468 1103.9811 1111.0685 1138.1075 1168.5579 1177.7100 1180.0798 1207.6582 1222.5242 1232.9601 1254.2615 1256.5008 1262.2602 1289.2637 1303.7255 1310.5404 1319.8112 1327.5805 1334.9074 1338.9420 1343.7693 1352.2345 1371.5355 1386.9064 1393.4088 1418.6825 1454.3979 1458.2879 1460.7409 1461.4887 1465.8447 1468.0785 1475.5759 1499.4293 1582.4859 1622.1104 2924.8274 2948.9340 2951.8056 2963.4911 2964.2504 2964.9685 2965.2535 2971.9080 2986.7587 3022.7500 3025.2625 3030.5723 3032.3308 3042.8309 3090.9544 3119.2710 3121.3238 3154.7115 3164.5605 3559.3821
redmass: 3.9533 3.9697 4.0445 3.4996 3.5648 3.6185 2.2954 2.3039 4.6876 1.8176 3.0639 2.2934 1.9828 1.8149 4.9697 3.4621 2.9239 3.1198 3.0115 2.1101 2.1053 2.3828 3.6953 6.7864 3.6308 2.8828 2.7367 1.5144 1.4018 3.4893 1.4979 1.6756 2.8851 1.5130 2.3825 2.9438 1.7596 1.4853 1.3675 2.5843 2.4967 1.8127 2.2724 1.8039 1.3454 1.2613 3.0059 1.5153 2.4324 1.8741 1.1799 1.2970 1.4677 1.8493 3.3957 1.4796 1.1369 1.2831 1.3088 1.4542 1.2564 1.3421 1.2610 1.3275 1.3697 1.4892 1.5654 1.6211 1.4833 1.7387 1.7063 2.9180 1.0801 1.0887 1.0902 1.0899 1.1166 1.0823 1.0974 2.4609 6.9651 6.4586 1.0567 1.0705 1.0801 1.0619 1.0600 1.0626 1.0656 1.0646 1.1038 1.0969 1.0951 1.1000 1.1028 1.1033 1.0927 1.0890 1.0885 1.0939 1.0950 1.0663
irintensity: 0.8896 0.8287 2.5023 3.4638 1.5088 5.1918 24.9711 49.6865 1.6308 0.2468 2.2699 95.9216 36.5832 0.0028 0.6798 0.5532 0.4140 0.2495 5.8362 0.7588 3.8029 23.3802 20.1219 0.8481 0.8130 3.5741 1.7100 1.1460 22.4161 3.1692 49.5248 8.1434 27.6259 3.6160 2.2232 62.5905 2.4462 1.1166 0.1614 15.1522 3.0077 68.8321 30.6510 0.8197 0.0996 0.0168 11.4866 11.8310 0.0007 11.6930 28.0956 82.9824 0.7578 37.3114 190.3178 0.6367 13.6935 1.7096 1.7983 2.8113 0.1368 1.1585 7.9624 0.0047 0.1443 0.4615 3.9077 1.7455 12.6431 24.8343 13.8655 0.7446 6.3748 1.7048 2.6574 10.1144 50.7288 20.4294 4.0923 131.2909 6.6010 38.7904 23.4677 109.0859 4.8970 37.7927 42.8267 25.6182 33.0758 40.8331 58.2689 95.2688 81.2305 2.6238 4.9528 130.7392 19.7488 14.8211 26.7358 18.0592 5.4680 6.4000
temp: 298.150 k
press: 1.00000 atm
elementType: 8 8 6 6 6 6 6 6 6 6 6 6 6 6 6 6 1 1 1 1 1 1 1 1 1 1 1 1 1 1 1 1 1 1 1 1
symmnumber: 1
zpe: 812922.3 jmol-1
zpe.correction: 0.309626 hartree
zpe.thermalcorrener: 0.325456 hartree
zpe.thermalcorrenthalpy: 0.326400 hartree
zpe.thermalcorrgfe: 0.264787 hartree
zpe.sumelectzpe: -694.687209 hartree
zpe.sumelectthermal: -694.671379 hartree
zpe.sumelectthermalent: -694.670435 hartree
zpe.sumelectthermalfe: -694.732048 hartree
dipole: 1.4144 -3.0249 0.0198
dipole: 3.3393
quadrupole: -103.0830 -91.0708 -97.0438
quadrupole: 16.2727 1.3016 -1.3254
quadrupole: -6.0171 5.9950 0.0221 16.2727 1.3016 -1.3254
hfenergy: -694.9968351 hartree
pointgroup: C01 [X(C14H20O2)]
dipole: 0.5624627 1.0216715 -0.6048567 debye
polarizability: 223.9785337|-3.4544086|132.5530196|-1.898681|-11.446153|118.9066826 unknown
InChI: InChI=1S/C14H20O2/c15-10-11-16-14-8-6-13(7-9-14)12-4-2-1-3-5-12/h6-9,12,15H,1-5,10-11H2
charge 0 multiplicity 1
36 atoms
O  -3.390245 -0.129419 0.459284
O  -6.142384 -0.476855 -0.670779
C  2.389149 -0.365269 0.268131
C  3.068988 0.81271 1.026122
C  2.950226 -0.457979 -1.181388
C  4.610872 0.685724 1.015793
C  4.491976 -0.586283 -1.192067
C  5.161519 0.579591 -0.426338
C  0.865524 -0.270879 0.296981
C  0.083942 -1.275929 0.927685
C  0.177677 0.815218 -0.298559
C  -1.321499 -1.204684 0.965317
C  -1.232649 0.908549 -0.272785
C  -1.985938 -0.10892 0.364116
C  -4.130453 0.959142 -0.182751
C  -5.624817 0.705537 0.019641
H  2.680634 -1.301558 0.791465
H  2.690508 0.851504 2.065877
H  2.776787 1.769567 0.545781
H  2.655732 0.452022 -1.744244
H  2.486643 -1.31731 -1.703496
H  4.905155 -0.221243 1.584394
H  5.065111 1.550524 1.537785
H  4.861091 -0.623445 -2.235632
H  4.781113 -1.546742 -0.716303
H  4.963118 1.530384 -0.963957
H  6.260663 0.445411 -0.40793
H  0.587441 -2.130442 1.396483
H  0.746006 1.611424 -0.794805
H  -1.922561 -1.980909 1.448907
H  -1.721488 1.767459 -0.74297
H  -3.85706 1.931938 0.280799
H  -3.877325 1.006584 -1.26569
H  -6.173834 1.622091 -0.292254
H  -5.827887 0.517645 1.086418
H  -5.873332 -0.448059 -1.623933
