program: Gaussian 09
title: 000160197
version: EM64L-G09RevD.01
frameworkgroup: C1[X(C8H6INO4)]
method: RPBEPBE
basis: SDD
operation: Freq
keyword: #p
keyword: freq=noraman
keyword: PBEPBE/SDD
title: #p freq=noraman PBEPBE/SDD
converged: YES YES NO NO
title: Mulliken charges:
elementType: I O O O O N C C C C C C C C H H H H H H
charge: 0.128267 -0.312720 -0.156248 -0.202311 -0.202293 0.024821 0.420836 0.392192 -0.310670 -0.310620 -0.331682 -0.331733 0.317027 -0.865406 0.260234 0.260330 0.292135 0.292150 0.317902 0.317789
chargesum: 0.00000
title: Mulliken charges with hydrogens summed into heavy atoms:
elementType: I O O O O N C C C C C C C C
charge: 0.128267 -0.312720 -0.156248 -0.202311 -0.202293 0.024821 0.420836 0.392192 -0.050436 -0.050289 -0.039546 -0.039583 0.317027 -0.229715
polarizability: 2.10935709e+02 1.35184382e-01 1.05338711e+02 -2.70602623e+00 -1.63853301e-01 7.52412854e+01
1716.lowfreq: -49.7583 -13.7624 -5.5512 -2.7391 0.0005 0.0005 0.0007 16.0605 34.3515
frequency: -49.7077 10.5994 34.3449 56.6701 64.8448 107.5145 168.8996 188.3326 215.8251 305.3982 373.6406 381.7777 411.6918 481.5793 504.0198 521.0326 562.5854 623.2690 627.9355 656.8741 674.4005 728.2569 759.0097 799.8074 830.9259 834.8043 856.9848 883.9702 981.1908 987.6171 1000.0026 1038.5202 1090.1495 1101.4440 1134.5927 1155.0617 1181.7999 1219.9097 1233.3560 1282.9015 1365.9017 1403.2061 1412.9321 1417.1176 1468.8779 1599.6619 1605.1415 1701.4477 3061.1921 3135.2050 3169.3428 3169.7211 3189.2597 3192.0410
redmass: 7.7661 5.9541 13.4849 3.3634 8.9520 10.3769 13.8525 10.3302 8.9809 7.4119 10.8739 5.8682 2.9237 3.7559 5.0343 3.3413 7.2691 7.1780 6.8338 5.3484 4.6582 5.9806 6.1902 7.3676 1.4865 1.3984 2.6543 3.2122 1.3514 1.3648 2.9732 3.9675 3.2789 1.2550 1.1660 1.5940 2.3457 6.7864 1.5150 1.2620 7.8314 9.4367 1.0956 4.3982 2.4334 6.5117 8.4300 11.2973 1.0574 1.1058 1.0902 1.0899 1.0962 1.0974
irintensity: 0.5806 1.1094 0.7754 3.1670 0.0373 1.8004 2.4557 3.9234 5.7332 0.8734 4.0190 3.0088 0.0081 14.0134 0.6881 0.3799 10.4976 0.1852 1.4727 18.8068 46.9271 10.1048 3.0725 12.1644 12.1010 6.4649 68.5606 138.7404 4.2585 0.0330 51.8405 739.0162 17.1849 20.4269 1.2345 160.5966 46.4344 292.5842 4.1167 1.5202 93.2562 0.8761 46.4318 47.2943 54.3823 92.5261 6.7323 131.8286 11.4930 0.2805 1.9072 0.8183 0.3921 6.1031
temp: 298.150 k
press: 1.00000 atm
elementType: 53 8 8 8 8 7 6 6 6 6 6 6 6 6 1 1 1 1 1 1
symmnumber: 1
zpe: 340711.9 jmol-1
zpe.correction: 0.129770 hartree
zpe.thermalcorrener: 0.142110 hartree
zpe.thermalcorrenthalpy: 0.143055 hartree
zpe.thermalcorrgfe: 0.086142 hartree
zpe.sumelectzpe: -674.502277 hartree
zpe.sumelectthermal: -674.489937 hartree
zpe.sumelectthermalent: -674.488993 hartree
zpe.sumelectthermalfe: -674.545905 hartree
dipole: -3.6684 0.0797 3.3799
dipole: 4.9888
quadrupole: -131.1829 -87.4906 -97.1770
quadrupole: 0.0900 2.8842 -0.0881
quadrupole: -25.8994 17.7929 8.1065 0.0900 2.8842 -0.0881
hfenergy: -674.6320473 hartree
pointgroup: C01 [X(C8H6I1N1O4)]
dipole: 1.5416128 0.0116173 -1.2147474 debye
dipolederiv: -0.1548117 0.0007989 -0.0447052 0.0027087 -0.0156282 0.0006678 -0.1044302 0.0007436 -0.0375774 -2.5528564 0.002389 -0.44031 0.0001028 -0.2534211 0.0007594 -0.3420295 0.0003763 -0.6200821 -0.6847591 0.0000889 0.138976 -0.0000661 -0.2324909 0.0016461 -0.3691461 0.0004401 -0.819815 -0.7406746 0.1954238 0.068514 0.2130977 -0.6640201 -0.0261973 0.0974695 -0.0363651 -0.2379278 -0.7401101 -0.1953956 0.0678023 -0.2135332 -0.6645784 0.0247433 0.0967412 0.0349597 -0.2377366 1.8464822 0.0004244 -0.2304905 0.0010643 1.0902632 0.0013719 -0.3146741 0.0013665 0.237035 1.6140221 -0.0005841 0.0751979 -0.0002469 0.3149671 0.0000959 -0.4078764 0.0007026 0.0160888 -0.7048812 -0.0003688 0.0901857 -0.0007971 0.0136418 -0.000035 0.1384824 0.0000265 0.0341664 -0.4544925 0.148949 -0.036425 0.2584034 -0.0154088 -0.0400134 0.0615156 -0.0125365 -0.1039615 -0.4545961 -0.1487117 -0.0370835 -0.2587913 -0.0162174 0.0403778 0.0611324 0.0126687 -0.1036387 0.204044 -0.0958226 -0.0456043 0.2137133 -0.0183049 -0.0158557 -0.053961 0.0195479 -0.0774636 0.204254 0.096091 -0.045432 -0.2134337 -0.0181246 0.0158656 -0.0546083 -0.019455 -0.0773787 2.2811041 -0.0006976 0.2597764 0.0073406 0.1872933 -0.0017137 0.657828 0.0006167 1.2524292 0.0619286 -0.006317 0.2973589 -0.0149527 -0.00479 -0.0026755 0.6416559 -0.0038753 0.0686861 0.0571844 -0.0657113 0.0309379 -0.0790436 0.0179045 0.0056664 0.0198975 0.0059892 0.1498833 0.0569876 0.0654968 0.0311175 0.0788849 0.0182617 -0.0060673 0.020112 -0.0063069 0.149792 0.0989571 0.0542202 0.0060923 0.0180943 0.0714412 -0.0046305 0.0141467 -0.0096943 0.1702122 0.0989479 -0.0540751 0.0059021 -0.0181437 0.0712881 0.004386 0.0140974 0.0093488 0.1702889 -0.0183612 0.0473072 -0.0946025 0.0007715 0.0567603 0.0575119 -0.0873753 0.0701676 0.0358629 -0.0183692 -0.0435056 -0.0972081 0.0048269 0.0611632 -0.0559037 -0.0889776 -0.0687211 0.0311368 unknown
polarizability: 210.5429264|-0.3768545|105.3392873|7.7650656|-0.2375934|75.6334918 unknown
InChI: InChI=1S/C8H6INO4/c9-5-8(11)14-7-3-1-6(2-4-7)10(12)13/h1-4H,5H2
charge 0 multiplicity 1
20 atoms
I  5.901082 -0.021669 0.840977
O  1.892139 0.003884 -0.923311
O  2.581103 -0.001559 1.325689
O  -4.266935 1.138285 0.35103
O  -4.265375 -1.143295 0.347132
N  -3.672891 -0.001909 0.236397
C  0.506614 0.002405 -0.570914
C  -2.214224 -0.000422 -0.042201
C  -0.164258 1.235783 -0.436404
C  -0.162442 -1.232367 -0.440291
C  -1.546306 1.237555 -0.168534
C  -1.544489 -1.237013 -0.172461
C  2.866943 0.002323 0.123774
C  4.226567 0.007703 -0.556381
H  0.390216 2.172174 -0.544899
H  0.393452 -2.167571 -0.551682
H  -2.10935 2.167386 -0.056707
H  -2.106162 -2.168023 -0.063596
H  4.334468 0.912443 -1.173934
H  4.327047 -0.876312 -1.204184
