program: Gaussian 09
title: 000160141
version: EM64L-G09RevD.01
frameworkgroup: C1[X(C6H12OS)]
method: RPBEPBE
basis: SDD
operation: Freq
keyword: #p
keyword: freq=noraman
keyword: PBEPBE/SDD
title: #p freq=noraman PBEPBE/SDD
converged: YES YES NO NO
title: Mulliken charges:
elementType: S O C C C C C C H H H H H H H H H H H H
charge: 0.157345 -0.189516 -0.362891 -0.439040 -0.641910 -0.581807 -0.652501 -0.041921 0.244583 0.234003 0.257684 0.225002 0.210435 0.233150 0.245968 0.248772 0.231191 0.233120 0.220460 0.167874
chargesum: 0.00000
title: Mulliken charges with hydrogens summed into heavy atoms:
elementType: S O C C C C C C
charge: 0.157345 -0.189516 -0.118308 0.052647 0.026677 -0.087067 0.032270 0.125952
polarizability: 1.11493878e+02 2.21422157e+00 8.38912524e+01 -4.37101281e+00 2.94958812e+00 6.66475725e+01
1716.lowfreq: -15.4319 -11.1800 -0.0024 -0.0017 0.0008 12.5822 25.4532 44.9079 56.0740
frequency: 23.2668 44.5319 56.0167 122.3203 129.4200 173.9660 224.9909 240.8930 273.2271 323.1065 345.5375 422.6213 514.0204 581.6954 632.4523 735.4551 785.3895 907.2158 959.3952 995.2677 1005.0702 1023.6295 1034.3469 1068.2565 1091.8937 1138.8068 1169.2473 1234.4228 1246.3219 1260.8202 1280.3881 1332.2876 1388.6469 1394.0831 1396.3753 1422.9510 1456.3718 1465.0959 1470.2128 1474.7457 1484.1634 1645.3650 2867.5616 2961.9545 2974.7724 2986.5306 2992.1447 3005.7989 3048.3319 3067.3577 3068.6676 3080.8183 3092.3513 3099.4091
redmass: 1.9320 4.4102 5.9629 2.1925 3.2266 3.1254 1.0699 1.1121 2.9407 3.2454 2.9765 3.4582 3.7464 3.3088 4.3581 1.4783 1.1137 1.6185 1.5077 1.7667 3.2474 1.3088 1.4763 2.1697 2.4632 2.1721 1.3643 1.2490 1.2597 1.3061 1.2591 1.5098 1.2052 1.1976 1.2029 1.0767 1.0852 1.0485 1.0394 1.0450 1.0475 8.3674 1.0851 1.0646 1.0384 1.0356 1.0838 1.0569 1.0942 1.0963 1.1054 1.0989 1.1002 1.1034
irintensity: 0.1993 0.8927 4.7363 4.6655 3.0910 7.6269 0.2889 0.2263 1.5240 1.0771 4.3518 1.5518 9.8542 3.8391 3.6101 8.1503 10.6017 7.0122 1.4998 17.3288 19.0948 3.5172 10.1108 0.5242 6.3561 12.3362 13.6089 5.8728 27.0441 5.9386 10.2284 4.7435 12.2730 4.4031 18.4188 19.5418 2.8586 12.4016 16.4980 8.9710 9.0977 195.4076 105.6512 16.7991 34.9276 33.5695 22.6907 26.4489 9.7778 31.2064 3.6713 28.4372 30.3636 46.2115
temp: 298.150 k
press: 1.00000 atm
elementType: 16 8 6 6 6 6 6 6 1 1 1 1 1 1 1 1 1 1 1 1
symmnumber: 1
zpe: 437952.8 jmol-1
zpe.correction: 0.166807 hartree
zpe.thermalcorrener: 0.177862 hartree
zpe.thermalcorrenthalpy: 0.178806 hartree
zpe.thermalcorrgfe: 0.128217 hartree
zpe.sumelectzpe: -708.442189 hartree
zpe.sumelectthermal: -708.431135 hartree
zpe.sumelectthermalent: -708.430191 hartree
zpe.sumelectthermalfe: -708.480780 hartree
dipole: -2.9078 3.3011 2.1488
dipole: 4.8959
quadrupole: -62.5938 -60.2740 -56.6919
quadrupole: 9.2011 0.7328 -0.9505
quadrupole: -2.7405 -0.4208 3.1613 9.2011 0.7328 -0.9505
hfenergy: -708.6089969 hartree
pointgroup: C01 [X(C6H12O1S1)]
dipole: -1.25858 -1.266943 -0.7218129 debye
dipolederiv: -0.4636924 0.1034343 0.0296237 0.0901763 -0.2669116 0.0920734 0.034344 0.0436205 -0.1161403 -0.8256312 -0.3066956 -0.0308006 -0.3939412 -0.6140346 0.0373715 -0.1759945 -0.051277 -0.3983092 0.2705357 -0.157451 -0.082728 -0.1694669 0.3653895 -0.0005787 -0.1324356 0.1111398 0.1424293 -0.0387776 -0.0776543 -0.045102 -0.1400502 -0.3720424 0.1536077 0.1286848 0.1727022 -0.0008523 -0.0469106 0.0009375 0.0162756 -0.0075802 -0.1007498 0.0431199 0.06639 -0.0285107 0.0456682 0.3990243 -0.0143287 0.1024048 0.0141528 0.0455316 -0.0849756 0.1860823 -0.1038784 0.1528476 -0.1020898 0.1078285 0.0135555 -0.0107246 0.0248676 -0.023819 -0.0966236 0.0323773 0.0515487 0.9207721 0.3750739 0.1795452 0.5350839 0.7727228 -0.196175 0.1859211 -0.2259235 0.552368 -0.0060652 0.0197474 -0.0082688 0.0511592 -0.0148344 0.0316129 0.0097214 -0.0135836 -0.1706907 -0.0537288 0.0708527 0.0399197 0.0991283 -0.0093752 -0.0505406 0.0511391 -0.0506221 0.0896648 0.0869799 -0.041172 0.0062182 -0.0438897 0.0898479 -0.0037821 -0.0445864 0.0176673 -0.074542 -0.1437057 -0.0963759 -0.0393007 -0.0365159 0.0857322 0.0048554 -0.0530605 -0.0022976 0.0771558 0.025492 0.1211491 0.0714145 0.116208 -0.1126925 -0.0600345 0.0640882 -0.0740572 0.0470308 0.0934263 0.0048325 -0.0457404 -0.018524 0.0827586 -0.0229493 -0.0328716 0.0565662 -0.1160676 -0.0405886 0.0279932 0.0377835 0.0084347 0.0674983 -0.0297145 -0.0202647 -0.014016 -0.1658573 -0.06912 -0.0576733 -0.0265547 -0.0896867 -0.1261623 0.0194467 -0.0520723 0.0339346 0.0494653 0.1103244 -0.0030596 0.0263801 0.0110929 0.0864674 0.0201432 0.0959951 -0.0190088 -0.1279388 0.0819334 -0.1157242 0.0321499 -0.0371074 -0.0981109 0.0465939 0.039143 0.0391306 0.0876412 -0.1555888 0.0338638 -0.1061041 0.0270788 0.076839 -0.0234756 -0.1191715 -0.0153499 0.0494875 -0.0425893 0.0044217 -0.1706714 -0.005028 0.0172587 0.04722 -0.1344285 0.0913865 -0.174909 unknown
polarizability: 111.1602367|-3.9616038|84.7093088|3.9731341|1.2558651|66.1631577 unknown
InChI: InChI=1S/C6H12OS/c1-3-8-6(2)4-5-7/h5-6H,3-4H2,1-2H3
charge 0 multiplicity 1
20 atoms
S  -0.853565 0.385523 0.594426
O  3.0772 1.303427 -0.030625
C  0.1906 -1.020041 -0.177295
C  1.657267 -0.697627 0.164077
C  -0.252177 -2.407291 0.313841
C  -2.466728 0.17527 -0.384573
C  -3.429667 1.315182 -0.020755
C  2.131836 0.608066 -0.468691
H  0.040148 -0.933534 -1.272073
H  2.309452 -1.511347 -0.22211
H  1.82288 -0.657202 1.257029
H  -1.316655 -2.596195 0.08949
H  0.34248 -3.201845 -0.178734
H  -0.113994 -2.496604 1.405817
H  -2.21296 0.192007 -1.459563
H  -2.901607 -0.80714 -0.131761
H  -3.668886 1.307131 1.057481
H  -2.994751 2.29931 -0.268729
H  -4.376646 1.206226 -0.581101
H  1.591274 0.896284 -1.40805
