program: Gaussian 09
title: 000155086
version: EM64L-G09RevD.01
frameworkgroup: C1[X(C16H25NO)]
method: RPBEPBE
basis: SDD
operation: Freq
keyword: #p
keyword: freq=noraman
keyword: PBEPBE/SDD
title: #p freq=noraman PBEPBE/SDD
converged: YES YES NO NO
title: Mulliken charges:
elementType: O N C C C C C C C C C C C C C C C C H H H H H H H H H H H H H H H H H H H H H H H H H
charge: -0.295049 -0.395787 -0.019844 -0.401174 -0.710757 -0.684089 0.249508 -0.348892 -0.442422 -0.683988 -0.163376 -0.397171 -0.238472 -0.126008 -0.202985 -0.227471 -0.229389 -0.203343 0.197230 0.255096 0.212528 0.222745 0.209881 0.202516 0.215574 0.229134 0.204527 0.289618 0.214352 0.199351 0.205616 0.199842 0.209349 0.220748 0.211804 0.221919 0.207604 0.228544 0.264210 0.223326 0.222722 0.224522 0.227950
chargesum: 0.00000
title: Mulliken charges with hydrogens summed into heavy atoms:
elementType: O N C C C C C C C C C C C C C C C C
charge: -0.295049 -0.106169 0.177386 0.066450 -0.075615 -0.034854 0.249508 0.064811 -0.036964 -0.042086 0.058543 -0.189567 -0.009928 0.138202 0.020341 -0.004750 -0.004866 0.024607
polarizability: 6.09585219e+02 1.85184061e+01 1.54733725e+02 -3.97841554e+01 -1.17304663e+01 1.23518859e+02
1716.lowfreq: -9.1900 -0.0014 -0.0009 0.0017 1.0266 3.5556 14.0608 20.3260 31.0541
frequency: 13.8611 19.4787 30.9885 40.0578 52.8822 58.6641 62.4011 75.5286 104.6160 119.6960 132.7136 177.0063 187.2733 190.6753 212.7069 226.1173 232.0544 241.4506 255.9757 264.5313 296.7149 320.7398 335.6406 355.2884 368.0146 379.5894 405.9221 450.9179 468.6037 522.2403 561.2052 572.2692 612.7259 686.3772 697.6205 739.4499 780.6221 801.4800 838.0221 866.1371 877.2839 879.8398 894.6301 911.7701 914.5958 917.5018 949.6851 951.8815 954.3799 977.7350 996.1397 1011.4723 1026.3084 1029.7468 1052.4725 1088.0260 1110.1778 1113.7466 1142.4367 1151.4069 1165.4574 1182.5010 1193.1515 1198.3190 1213.4043 1230.5779 1246.5808 1256.4714 1264.2595 1274.2346 1282.6762 1288.3985 1295.3451 1300.5581 1302.9496 1313.7772 1329.6460 1334.9694 1357.1295 1367.2895 1374.8249 1387.7864 1396.1791 1448.1711 1457.9498 1461.6865 1472.8189 1473.0368 1476.7545 1477.0347 1482.6330 1485.3345 1490.9837 1568.0706 1575.7664 1611.9314 1635.1450 1653.3613 2947.6815 2962.1650 2964.3694 2973.7757 2977.2982 2979.0785 2981.1110 3012.6884 3037.5048 3055.6002 3064.5813 3067.7707 3070.0053 3072.8627 3073.4897 3075.0212 3078.4041 3080.7297 3083.3267 3083.3645 3089.9499 3091.2484 3097.2987 3105.8012 3552.5149
redmass: 4.3070 3.9355 3.6036 2.4451 4.0558 2.6494 3.4671 2.5061 3.2281 3.6855 2.4085 2.7671 3.3311 1.3072 2.7212 1.2081 1.1457 2.0372 3.0060 3.8054 2.7767 2.8585 3.3651 2.4136 2.2418 2.1265 3.1686 3.4012 3.5365 1.2586 2.9566 2.9896 2.5296 4.0140 4.0719 1.1072 3.1639 1.5061 1.7180 1.4110 1.9591 1.8126 1.7832 1.8952 1.2829 1.2909 1.5221 2.0689 1.1544 2.3904 1.1191 1.9516 1.1062 2.3205 2.3889 2.0150 2.1021 1.9965 1.9392 2.1835 1.5706 2.5139 2.0572 1.6444 1.4361 1.4516 1.3819 1.1795 1.3394 1.2566 1.7357 1.3404 1.3035 1.4928 1.2830 1.5348 1.5415 1.4653 1.3385 1.5914 1.2286 1.2124 1.2246 1.1189 1.0932 1.0687 1.0590 1.0563 1.0714 1.3491 1.1536 1.0760 1.1253 6.0664 5.4425 4.8646 5.7240 5.6868 1.0625 1.0775 1.0361 1.0355 1.0453 1.0612 1.0608 1.0947 1.1014 1.0992 1.0973 1.0991 1.0950 1.0990 1.0985 1.0990 1.0915 1.0923 1.0916 1.0988 1.0895 1.0924 1.0868 1.0866 1.0771
irintensity: 0.3805 0.1848 0.0238 0.7405 3.2358 3.3624 0.3311 0.8058 1.3413 2.7098 1.0460 0.4371 0.4081 0.5205 1.0149 0.1779 0.3763 0.9253 0.2526 9.1320 0.9294 2.6251 12.7491 4.3767 4.6164 6.6012 2.0748 1.4931 6.0227 98.2409 4.1847 8.6846 22.3009 0.7780 2.2990 11.8449 7.0282 2.5021 14.6770 6.9025 3.4776 3.2703 23.3749 0.6098 2.1913 3.1664 1.1521 8.1247 0.7844 4.2744 17.0945 15.8251 183.1075 13.7759 12.9111 31.8165 66.3825 53.6554 4.7325 102.0585 81.8276 32.1778 36.9705 0.6095 0.3071 25.1149 61.1616 117.9399 16.6835 0.5283 0.2284 0.0837 9.5964 7.7081 0.4615 95.7655 25.1359 16.2519 9.1406 55.0891 26.4936 6.9821 17.2968 32.4038 13.2471 19.5638 3.1340 4.2717 19.4016 175.1929 214.3147 15.5563 44.0348 299.1141 106.4724 130.7461 87.1275 6.4808 42.4597 10.4641 36.9942 68.0041 79.5527 30.1700 69.6462 7.4642 12.9804 57.9761 1.2998 15.8729 7.4290 127.8780 78.1728 51.9339 5.0231 0.2285 4.3588 37.0420 5.5730 20.4011 76.8283 35.0886 31.9621
temp: 298.150 k
press: 1.00000 atm
elementType: 8 7 6 6 6 6 6 6 6 6 6 6 6 6 6 6 6 6 1 1 1 1 1 1 1 1 1 1 1 1 1 1 1 1 1 1 1 1 1 1 1 1 1
symmnumber: 1
zpe: 972649.5 jmol-1
zpe.correction: 0.370463 hartree
zpe.thermalcorrener: 0.392462 hartree
zpe.thermalcorrenthalpy: 0.393407 hartree
zpe.thermalcorrgfe: 0.315746 hartree
zpe.sumelectzpe: -753.250637 hartree
zpe.sumelectthermal: -753.228637 hartree
zpe.sumelectthermalent: -753.227693 hartree
zpe.sumelectthermalfe: -753.305354 hartree
dipole: -2.1069 3.4029 -0.6067
dipole: 4.0481
quadrupole: -80.1225 -110.5245 -115.0953
quadrupole: 14.1191 -5.5486 -4.7366
quadrupole: 21.7916 -8.6104 -13.1812 14.1191 -5.5486 -4.7366
hfenergy: -753.6210996 hartree
pointgroup: C01 [X(C16H25N1O1)]
dipole: -0.8367457 1.2026405 -0.6244809 debye
polarizability: 609.6338427|9.4609881|145.5227102|-42.4281955|-18.7920496|132.6812501 unknown
InChI: InChI=1S/C16H25NO/c1-4-5-6-7-8-9-10-11-12-13-16(18)17-14-15(2)3/h6-13,15,17H,4-5,14H2,1-3H3
charge 0 multiplicity 1
43 atoms
O  3.853602 -1.621867 0.302963
N  4.946117 0.068896 -0.884024
C  7.192679 0.309712 0.277412
C  6.291015 -0.49478 -0.702855
C  7.474773 1.740005 -0.242415
C  6.595804 0.335628 1.702497
C  3.800436 -0.536228 -0.36492
C  -8.450663 -0.420814 -0.302905
C  -7.475608 0.55293 0.419799
C  -9.872985 0.164033 -0.435259
C  -6.101374 -0.034898 0.623197
C  2.532952 0.183013 -0.660024
C  -4.933515 0.485877 0.124869
C  1.32724 -0.29501 -0.204361
C  -3.62459 -0.10688 0.327936
C  0.044684 0.327653 -0.435822
C  -2.443173 0.415342 -0.164969
C  -1.147452 -0.183802 0.047386
H  8.15837 -0.238697 0.311225
H  6.142937 -1.519406 -0.318203
H  6.791884 -0.561976 -1.68996
H  8.192667 2.263167 0.415501
H  7.900851 1.725689 -1.264148
H  6.547819 2.345832 -0.261046
H  5.624782 0.864757 1.708753
H  6.417541 -0.686917 2.080149
H  7.273336 0.856268 2.404696
H  4.845756 0.937029 -1.412066
H  -8.043838 -0.660473 -1.30438
H  -8.490681 -1.376851 0.257001
H  -7.405591 1.498098 -0.1535
H  -7.920552 0.809418 1.405763
H  -10.308968 0.377084 0.559114
H  -10.548369 -0.537763 -0.957645
H  -9.862212 1.111099 -1.006978
H  -6.052655 -0.965439 1.212641
H  2.57585 1.108575 -1.252914
H  -4.977284 1.413102 -0.467307
H  1.359249 -1.225637 0.381978
H  -3.582627 -1.035401 0.918767
H  0.022987 1.256234 -1.026664
H  -2.480564 1.343848 -0.755184
H  -1.114328 -1.112648 0.637804
