program: Gaussian 09
title: 000160195
version: EM64L-G09RevD.01
frameworkgroup: C1[X(C17H22O)]
method: RPBEPBE
basis: SDD
operation: Freq
keyword: #pfreq=noraman
keyword: PBEPBE/SDD
title: #p freq=noraman PBEPBE/SDD
converged: YES YES NO NO
title: Mulliken charges:
elementType: O C C C C C C C C C C C C C C C C C H H H H H H H H H H H H H H H H H H H H H H
charge: -0.439212 -0.366870 -0.396444 -0.376496 -0.563845 -0.353604 0.249576 0.217156 -0.356299 0.109999 0.429067 -0.399170 -0.696866 -0.419873 -0.464875 -0.447019 -0.266195 -0.250498 0.196398 0.187016 0.213086 0.221748 0.192430 0.190279 0.205786 0.250167 0.187179 0.188378 0.194763 0.195329 0.239399 0.209746 0.209361 0.214711 0.213478 0.237517 0.238540 0.224117 0.226837 0.355206
chargesum: 0.00000
title: Mulliken charges with hydrogens summed into heavy atoms:
elementType: O C C C C C C C C C C C C C C C C C
charge: -0.084006 0.016543 0.038389 0.006212 -0.107893 0.021953 0.249576 0.217156 0.033792 0.109999 0.429067 -0.159771 -0.063048 -0.206395 -0.227358 -0.208479 -0.042078 -0.023661
polarizability: 2.28864687e+02 -1.23703675e+01 2.27196622e+02 -2.53481277e+01 -8.00722889e+00 1.20615730e+02
1716.lowfreq: -7.7153 0.0001 0.0002 0.0005 1.2231 6.8275 19.0618 37.0908 48.8250
frequency: 18.8357 37.0246 48.6041 61.3214 85.1147 99.1700 113.1963 126.5095 141.5655 147.7466 198.9054 218.3410 224.9362 285.5944 296.0095 328.5128 335.6406 352.5375 399.9051 419.8818 428.9090 458.5795 486.6102 519.0871 529.9758 560.7158 604.0760 670.3115 694.8617 721.0151 722.6010 731.8199 752.9077 760.0769 790.8238 804.9489 818.7874 856.2599 873.6141 884.0952 888.1135 931.1066 933.1751 961.5283 985.2514 987.1829 997.4962 1025.6244 1030.5033 1035.2544 1059.5395 1071.6929 1078.5966 1105.3491 1117.1443 1147.9240 1163.0346 1173.9848 1189.0507 1212.2579 1218.9690 1228.9812 1239.3034 1247.0313 1261.4136 1271.0617 1276.5965 1280.5740 1291.7246 1292.4702 1310.3811 1334.8789 1349.0267 1353.2001 1371.5939 1387.9486 1405.2666 1423.2218 1437.7974 1462.1237 1462.7311 1467.8214 1470.0923 1473.5875 1475.6742 1480.2168 1486.5113 1489.9280 1518.0766 1589.9161 1609.2071 1635.9980 2949.0767 2950.9498 2957.7577 2968.2297 2971.0146 2973.4184 2985.2249 2993.4142 2995.8267 3011.9507 3028.0873 3039.2815 3063.6465 3067.4478 3070.0219 3107.1121 3118.7490 3130.0952 3142.7391 3149.5802 3163.5948 3586.2742
redmass: 4.5998 4.0298 2.2866 1.9731 3.9899 1.8624 5.0860 2.0932 2.5197 2.6760 3.9276 3.7761 1.1306 3.8275 4.0724 1.1713 2.5362 3.8828 3.6348 3.2537 6.7230 2.8747 3.6629 5.1170 3.4486 3.4382 4.8639 3.9320 5.1815 3.6923 1.0721 1.1433 1.3266 1.1910 3.0713 1.4758 1.3055 4.4643 1.6974 1.7830 1.8749 1.7155 1.3459 1.4142 3.4836 1.5131 1.2217 3.2623 2.1852 3.6703 2.8785 2.5230 2.1988 1.4597 2.4784 1.4620 1.1996 1.1200 1.7097 1.5717 1.2831 1.5762 1.5287 3.3192 1.3606 1.3371 1.5106 1.0359 1.1537 1.0869 1.3864 1.4236 1.5634 1.6727 2.5122 1.2172 2.9853 4.0037 3.4195 1.0710 1.0784 1.1575 2.2581 1.0968 1.0426 1.0918 1.1110 1.1038 3.4185 7.5503 5.7543 6.7377 1.0591 1.0589 1.0592 1.0586 1.0369 1.0599 1.0961 1.0770 1.0848 1.1017 1.1023 1.1032 1.1019 1.1007 1.0993 1.0876 1.0862 1.0885 1.0962 1.0941 1.0997 1.0660
irintensity: 0.0655 0.4039 0.0650 0.0443 0.2294 0.0256 0.6336 0.0318 0.0274 0.0101 0.6889 8.7544 0.0019 0.1406 2.8062 110.2483 17.5419 0.3372 1.5152 6.0414 2.0749 5.7734 2.3147 0.8785 0.4630 5.0262 4.9095 4.7568 7.1541 1.3143 13.1369 0.3999 28.7848 3.5827 9.2099 91.7418 1.2620 2.4339 2.1459 9.9004 4.7202 38.0915 1.6609 3.8865 1.2932 0.2911 10.7943 2.4276 2.0863 5.8421 47.3252 0.9246 0.3527 60.5973 13.6702 31.9243 22.2350 1.1890 1.3691 10.5825 9.6604 11.0797 10.2759 129.8012 3.3111 0.2341 4.5488 0.1196 0.0701 0.5582 1.2391 1.5002 0.2199 0.7214 5.2984 11.1986 13.1361 9.4724 5.1999 0.1293 0.3518 1.3798 7.9586 1.8539 12.2446 1.2738 3.3787 33.7423 31.1445 5.7694 10.5794 32.0300 3.6905 0.2657 26.2096 79.9868 39.1899 52.9740 1.0960 27.0722 22.8964 1.4366 5.6468 88.9342 29.0815 104.9965 56.9532 14.2210 3.0825 7.2810 21.4411 39.3670 27.5400 41.5832
temp: 298.150 k
press: 1.00000 atm
elementType: 8 6 6 6 6 6 6 6 6 6 6 6 6 6 6 6 6 6 1 1 1 1 1 1 1 1 1 1 1 1 1 1 1 1 1 1 1 1 1 1
symmnumber: 1
zpe: 901565.9 jmol-1
zpe.correction: 0.343388 hartree
zpe.thermalcorrener: 0.361611 hartree
zpe.thermalcorrenthalpy: 0.362555 hartree
zpe.thermalcorrgfe: 0.295365 hartree
zpe.sumelectzpe: -734.901093 hartree
zpe.sumelectthermal: -734.882870 hartree
zpe.sumelectthermalent: -734.881926 hartree
zpe.sumelectthermalfe: -734.949116 hartree
dipole: 0.8339 1.0805 -0.6552
dipole: 1.5139
quadrupole: -103.1920 -94.4997 -113.2803
quadrupole: 5.2636 -5.3978 -3.8291
quadrupole: 0.4653 9.1577 -9.6230 5.2636 -5.3978 -3.8291
hfenergy: -735.2444812 hartree
pointgroup: C01 [X(C17H22O1)]
dipole: -0.3182465 0.4342846 0.2547406 debye
polarizability: 229.3803976|12.1362946|226.7652857|-25.3378998|7.7645323|120.5313559 unknown
InChI: InChI=1S/C17H22O/c1-2-3-4-5-6-11-16-15-10-8-7-9-14(15)12-13-17(16)18/h7-10,12-13,18H,2-6,11H2,1H3
charge 0 multiplicity 1
40 atoms
O  -0.811085 3.178054 -0.297009
C  2.714314 0.196877 -0.638658
C  1.311591 0.367236 -0.015358
C  3.813504 -0.082735 0.411283
C  0.218715 0.684258 -1.076244
C  5.216034 -0.281391 -0.206716
C  -1.168802 0.803212 -0.47037
C  -2.011574 -0.346157 -0.238152
C  6.315525 -0.550747 0.846293
C  -1.653441 2.063133 -0.080926
C  -3.321393 -0.18091 0.368681
C  -1.599863 -1.67951 -0.586003
C  7.712584 -0.754263 0.22097
C  -2.941235 2.236909 0.516891
C  -3.760048 1.131696 0.735453
C  -4.152174 -1.328095 0.590863
C  -2.430649 -2.778958 -0.357354
C  -3.721152 -2.607162 0.235964
H  2.975869 1.112092 -1.209821
H  2.692072 -0.633728 -1.375799
H  1.035898 -0.552992 0.538342
H  1.330745 1.188683 0.72761
H  3.847597 0.757311 1.136099
H  3.540228 -0.985886 0.996417
H  0.23572 -0.098943 -1.858167
H  0.48045 1.637013 -1.569483
H  5.18489 -1.126884 -0.925766
H  5.488653 0.618171 -0.797687
H  6.039654 -1.447251 1.438583
H  6.348046 0.295896 1.562105
H  -0.616423 -1.836868 -1.039522
H  8.027821 0.142694 -0.345132
H  7.7103 -1.609008 -0.48187
H  8.478933 -0.953382 0.992751
H  -3.278494 3.242674 0.801581
H  -4.747909 1.257535 1.193048
H  -5.138751 -1.181775 1.047485
H  -2.093491 -3.784447 -0.633536
H  -4.362583 -3.478117 0.408813
H  -1.261273 4.011463 -0.01336
