program: Gaussian 09
title: 000155083
version: EM64L-G09RevD.01
frameworkgroup: C1[X(C18H28N2O4)]
method: RPBEPBE
basis: SDD
operation: Freq
keyword: #p
keyword: freq=noraman
keyword: PBEPBE/SDD
title: #p freq=noraman PBEPBE/SDD
converged: YES YES NO NO
title: Mulliken charges:
elementType: O O O O N N C C C C C C C C C C C C C C C C C C H H H H H H H H H H H H H H H H H H H H H H H H H H H H
charge: -0.245178 -0.458785 -0.217887 -0.257015 -0.319503 -0.470059 -0.175772 -0.390846 -0.006617 -0.307450 -0.677194 -0.723117 0.229289 0.240690 0.518594 -0.606130 -0.339043 -0.362959 -0.526709 -0.347015 0.110485 0.211745 -0.682454 -0.788134 0.213628 0.181245 0.282872 0.174043 0.254846 0.221310 0.252658 0.211062 0.253679 0.190996 0.223585 0.204693 0.213122 0.346528 0.232087 0.259567 0.312995 0.233600 0.202988 0.301834 0.204801 0.245048 0.205837 0.224511 0.210820 0.238498 0.231654 0.262557
chargesum: 0.00000
title: Mulliken charges with hydrogens summed into heavy atoms:
elementType: O O O O N N C C C C C C C C C C C C C C C C C C
charge: -0.245178 -0.112256 -0.217887 -0.257015 -0.064658 -0.168225 0.037856 0.073271 0.167426 0.166518 -0.021457 -0.081718 0.229289 0.240690 0.518594 -0.374043 -0.079475 -0.049964 -0.090121 0.102834 0.110485 0.211745 -0.041286 -0.055425
polarizability: 3.35765527e+02 -9.17627000e+00 2.27343556e+02 2.25970121e+01 6.68479629e+00 1.66505673e+02
1716.lowfreq: -7.1194 -1.5763 -0.0005 -0.0003 0.0009 3.8867 10.1265 19.5622 27.3352
frequency: 9.5022 19.4301 27.2412 32.1596 37.9267 48.2286 55.5568 59.5781 68.5599 78.8409 112.6916 120.3211 123.6152 129.8307 161.5736 166.0048 180.6692 190.8978 203.2789 214.7462 219.2440 230.8342 236.6576 247.5849 265.1108 280.7003 300.1339 334.2907 357.4195 362.4593 369.9310 379.5712 403.3064 420.4582 432.9026 458.7555 467.8030 513.5766 533.8170 539.0240 604.0479 609.6938 617.7805 622.7440 645.6090 684.9323 690.0817 738.4994 742.4077 754.7125 784.2496 824.2443 842.0630 854.6303 861.5146 881.0417 887.1389 895.2787 908.3485 920.0303 941.3227 946.2298 958.4048 965.3075 976.0917 986.3605 1017.0277 1018.0286 1049.3883 1058.6642 1060.0375 1067.7652 1084.7229 1104.7965 1114.7459 1150.6881 1155.4059 1160.4631 1179.3173 1182.5131 1195.3196 1213.7560 1223.3056 1234.7407 1245.6726 1254.4968 1271.2997 1276.9188 1298.2338 1307.3816 1312.4855 1328.3401 1338.8715 1345.9482 1347.1938 1365.3555 1368.3014 1370.2098 1379.1005 1392.2144 1394.2210 1398.9452 1413.6352 1444.4803 1445.6522 1451.2616 1452.7071 1463.0804 1465.2142 1467.7952 1475.5604 1476.1346 1478.5987 1478.8878 1486.5277 1490.3895 1491.8798 1502.4884 1567.1094 1593.1548 1619.5235 1624.9752 2821.7741 2837.7387 2967.8882 2971.1323 2973.1074 2978.2414 2982.7866 2983.0323 2989.9571 2994.3214 3021.4029 3046.6570 3049.2824 3062.9206 3071.3626 3072.2271 3073.6317 3076.6338 3077.2150 3084.8855 3086.3125 3122.4299 3130.6655 3165.6849 3193.0899 3439.5913 3530.3260 3571.6149
redmass: 3.8985 3.2855 3.8508 3.1030 2.9461 4.3883 4.3367 3.6901 5.2109 2.7526 3.5150 3.7428 4.0406 5.1865 1.6785 1.6981 1.5991 3.0893 2.3540 2.5662 2.3908 1.2137 1.4795 3.2351 2.3907 1.1358 4.6035 5.8940 2.3858 3.7924 3.2652 4.8670 3.0242 3.2891 2.8437 3.5988 2.7440 3.5497 3.6823 3.3895 4.1386 3.2533 3.3221 1.9615 1.6468 5.1022 1.5117 2.6977 1.3715 3.9379 4.5857 2.2764 1.5537 2.6295 1.9178 1.6583 2.3156 2.2713 1.9788 1.1878 2.4535 1.6133 1.9582 3.8348 5.7955 1.3406 1.7367 1.7980 2.2864 2.5623 2.2322 1.7918 1.5193 2.2641 2.0337 1.9202 1.4419 1.8911 2.3453 1.2920 1.9181 1.3025 1.6389 1.5814 3.4072 1.1708 1.7999 1.2544 1.6664 1.3254 1.6639 1.3306 1.3593 1.4487 1.6019 1.4751 2.4457 1.3264 1.3255 1.2160 1.2128 3.8782 1.9366 1.1874 1.1047 1.0901 1.1599 1.0774 1.0537 1.0619 1.0892 1.0470 1.0481 1.1076 1.0821 1.4610 1.4403 2.3043 5.6065 8.1420 4.5861 6.2930 1.0725 1.0808 1.0583 1.0361 1.0367 1.0360 1.0832 1.0393 1.0567 1.0645 1.0974 1.0866 1.0998 1.0986 1.1078 1.0957 1.0996 1.0986 1.1022 1.0994 1.0993 1.0997 1.0901 1.0893 1.0956 1.0739 1.0763 1.0663
irintensity: 0.3847 0.2904 1.8083 0.9344 0.6325 2.9768 2.2438 2.6836 3.2734 1.3920 3.7794 1.9949 4.0363 9.3679 0.7607 1.2125 4.9526 4.7205 6.3081 11.2290 2.6803 0.5305 2.3400 5.3990 16.7317 135.0068 3.7788 7.3700 0.9888 2.7777 4.0328 2.9167 12.5945 2.5958 7.4994 6.2542 5.6277 5.8629 13.9517 15.3470 8.2072 13.3578 24.8279 31.1868 28.5510 5.4428 70.3667 4.4681 3.9963 6.0126 4.5078 3.8285 45.6392 8.8523 1.2437 32.5023 0.8899 19.6600 9.9285 5.1608 57.2185 8.5174 30.8413 8.9401 53.2685 2.8003 15.5876 2.9138 62.0774 6.9138 15.2263 5.1127 22.5256 10.5626 4.2228 10.4394 53.3820 8.3380 99.8669 48.1832 28.9392 36.5320 103.5530 123.7504 182.2579 11.9926 38.9018 18.2054 65.8987 1.9081 32.9611 5.9230 42.4386 9.1855 7.4069 53.5574 53.0262 16.3052 33.9201 8.3909 18.9493 12.4441 2.9767 13.4590 10.3882 32.8548 107.6318 21.9428 18.4100 1.8652 4.5161 9.5120 13.9860 30.7478 18.1946 251.5033 98.0805 381.9341 84.1493 183.1491 127.7219 19.3164 108.4905 172.1513 14.8125 38.0144 45.4579 23.6611 49.1033 5.8391 35.2881 25.0623 15.7344 0.4382 0.6056 38.5317 24.2161 17.5213 27.0080 48.5716 69.6301 27.0894 57.7133 13.7933 15.3363 6.3123 10.1371 1.0719 9.9714 5.9008
temp: 298.150 k
press: 1.00000 atm
elementType: 8 8 8 8 7 7 6 6 6 6 6 6 6 6 6 6 6 6 6 6 6 6 6 6 1 1 1 1 1 1 1 1 1 1 1 1 1 1 1 1 1 1 1 1 1 1 1 1 1 1 1 1
symmnumber: 1
zpe: 1142839.5 jmol-1
zpe.correction: 0.435285 hartree
zpe.thermalcorrener: 0.462844 hartree
zpe.thermalcorrenthalpy: 0.463788 hartree
zpe.thermalcorrgfe: 0.373324 hartree
zpe.sumelectzpe: -1111.241140 hartree
zpe.sumelectthermal: -1111.213581 hartree
zpe.sumelectthermalent: -1111.212637 hartree
zpe.sumelectthermalfe: -1111.303100 hartree
dipole: 1.4930 2.9966 -0.2615
dipole: 3.3581
quadrupole: -118.3761 -148.2379 -142.8237
quadrupole: 21.0198 7.8965 1.5959
quadrupole: 18.1031 -11.7587 -6.3445 21.0198 7.8965 1.5959
hfenergy: -1111.6764245 hartree
pointgroup: C01 [X(C18H28N2O4)]
dipole: 0.5415166 -1.1890829 -0.1959738 debye
polarizability: 337.7851941|8.9962427|218.629188|-13.6132072|22.3418816|173.200374 unknown
InChI: InChI=1S/C18H28N2O4/c1-5-6-18(23)20-14-7-8-17(16(9-14)13(4)21)24-11-15(22)10-19-12(2)3/h7-9,12,15,19-20,22H,5-6,10-11H2,1-4H3
charge 0 multiplicity 1
52 atoms
O  -1.869581 -0.16232 0.999826
O  -4.674402 1.935886 2.031483
O  -2.090882 -2.410034 -0.55084
O  4.436707 1.79894 0.207915
N  -4.479861 1.303041 -0.816256
N  3.607453 -0.310592 -0.402146
C  -4.016286 0.702182 1.541351
C  -4.594348 0.23784 0.193138
C  -4.846443 0.92971 -2.206522
C  -2.535025 1.080019 1.433377
C  -3.73961 0.062813 -2.848863
C  -5.079283 2.2183 -3.021468
C  -0.539618 -0.122806 0.617582
C  0.005797 -1.302689 0.005638
C  2.229684 -0.199249 -0.048475
C  1.393308 -1.313412 -0.290266
C  0.29903 0.996347 0.853081
C  1.665465 0.972002 0.523849
C  5.98513 0.194655 -0.81709
C  7.138459 0.581738 0.140462
C  -0.838835 -2.484425 -0.376808
C  4.619387 0.644226 -0.283714
C  8.525656 0.308172 -0.47567
C  -0.134528 -3.828697 -0.60254
H  -4.129655 -0.118742 2.280299
H  -5.651212 -0.104268 0.356373
H  -4.009094 -0.642651 -0.127455
H  -5.798179 0.336782 -2.218908
H  -4.959546 2.15773 -0.501887
H  -2.144791 1.413865 2.413889
H  -2.409735 1.867209 0.667668
H  -2.805544 0.649224 -2.924189
H  -3.521191 -0.840554 -2.252641
H  -4.04249 -0.259591 -3.863092
H  -4.164458 2.839627 -3.017504
H  -5.908744 2.819427 -2.600475
H  -5.331877 1.976967 -4.069154
H  -5.598296 1.711085 2.307857
H  1.8246 -2.210352 -0.750442
H  -0.113632 1.899597 1.3105
H  2.305288 1.837076 0.707375
H  6.146786 0.705265 -1.788353
H  6.004876 -0.894971 -1.020827
H  3.886658 -1.207936 -0.804928
H  7.029465 0.024281 1.091235
H  7.030058 1.652901 0.389396
H  8.656298 -0.762233 -0.724571
H  9.332383 0.59068 0.224586
H  8.668177 0.890136 -1.405923
H  0.584094 -4.063447 0.202366
H  0.416426 -3.827466 -1.56305
H  -0.903341 -4.61479 -0.654989
