program: Gaussian 09
title: 000160128
version: EM64L-G09RevD.01
frameworkgroup: C1[X(C6H13NO3)]
method: RPBEPBE
basis: SDD
operation: Freq
keyword: #p
keyword: freq=noraman
keyword: PBEPBE/SDD
title: #p freq=noraman PBEPBE/SDD
converged: YES YES NO NO
title: Mulliken charges:
elementType: O O O N C C C C C C H H H H H H H H H H H H H
charge: -0.465258 -0.498126 -0.221614 -0.569696 -0.055968 -0.229568 -0.090304 -0.435287 -0.716341 -0.076330 0.219157 0.265984 0.246673 0.226204 0.227855 0.243364 0.227130 0.205477 0.282656 0.298676 0.358553 0.201382 0.355380
chargesum: 0.00000
title: Mulliken charges with hydrogens summed into heavy atoms:
elementType: O O O N C C C C C C
charge: -0.106705 -0.142746 -0.221614 0.011636 0.163189 0.036416 0.156369 0.018773 -0.040370 0.125051
polarizability: 9.38248681e+01 -2.31318157e+00 7.84424381e+01 4.05957782e+00 1.74137568e+00 7.44123399e+01
1716.lowfreq: -9.4754 0.0009 0.0010 0.0012 9.6001 23.6314 55.3676 56.9382 84.4162
frequency: 55.1005 56.9355 84.3784 105.7554 172.6883 209.3405 230.3003 246.8290 260.1972 278.2438 295.4576 308.2116 397.5155 451.7296 458.4551 487.0822 539.8157 553.9683 659.2874 718.3772 793.4255 818.5057 879.3883 927.9445 954.9549 968.2682 1003.6298 1030.3831 1049.1558 1063.2265 1093.0418 1118.7918 1150.9334 1166.0029 1200.0496 1228.1358 1273.7760 1305.2666 1327.5925 1336.0151 1361.3434 1369.7978 1372.3111 1389.7968 1397.1753 1436.0502 1465.0327 1474.2478 1606.7405 1655.7250 2912.8194 2975.5961 3010.6727 3018.3632 3022.8854 3036.8134 3066.2952 3091.3802 3098.6177 3428.9657 3453.6065 3557.9140 3600.1763
redmass: 5.1556 5.7944 4.4155 3.5240 2.9455 2.5534 1.2163 2.7141 1.1881 1.2329 2.6514 3.4652 2.5482 3.6052 2.8233 3.4692 2.1350 1.1672 3.0936 1.5054 3.2113 2.8106 2.2072 2.4126 2.1824 2.0782 1.9820 1.9108 2.9373 1.6479 1.9592 2.1537 1.2372 1.4688 1.3142 1.3774 1.3471 1.3680 1.2447 1.3403 1.4356 1.2683 1.2546 1.2340 1.3773 1.1378 1.0451 1.0644 6.7679 1.0903 1.0867 1.0371 1.0713 1.0785 1.0806 1.0872 1.0975 1.0996 1.1037 1.0469 1.0642 1.0951 1.0667
irintensity: 7.2427 4.2441 6.1969 7.2487 9.5905 8.3076 2.9740 9.6628 32.1852 106.6474 8.2070 5.7774 14.2242 9.5670 2.7003 2.5087 30.6829 163.1845 32.7316 259.1999 40.2494 39.5607 3.9331 31.7951 42.8021 21.2974 23.2704 4.5396 37.5710 99.5809 16.1012 29.9239 34.8272 9.7155 9.9433 32.2442 37.5381 13.9953 4.9439 2.3522 29.6329 1.4460 2.9890 23.5076 32.2493 14.1555 9.7431 13.2001 140.0641 36.1749 82.5538 28.2309 5.1538 10.7180 10.7645 37.4084 36.0161 22.5908 17.1348 1.8098 41.0639 6.5140 6.5536
temp: 298.150 k
press: 1.00000 atm
elementType: 8 8 8 7 6 6 6 6 6 6 1 1 1 1 1 1 1 1 1 1 1 1 1
symmnumber: 1
zpe: 502793.3 jmol-1
zpe.correction: 0.191504 hartree
zpe.thermalcorrener: 0.203768 hartree
zpe.thermalcorrenthalpy: 0.204712 hartree
zpe.thermalcorrgfe: 0.153377 hartree
zpe.sumelectzpe: -515.999428 hartree
zpe.sumelectthermal: -515.987164 hartree
zpe.sumelectthermalent: -515.986220 hartree
zpe.sumelectthermalfe: -516.037554 hartree
dipole: -3.3641 1.2964 -1.7243
dipole: 3.9964
quadrupole: -59.9381 -61.5155 -60.7282
quadrupole: -1.2148 -5.9450 -0.6978
quadrupole: 0.7892 -0.7882 -0.0010 -1.2148 -5.9450 -0.6978
hfenergy: -516.1909319 hartree
pointgroup: C01 [X(C6H13N1O3)]
dipole: 1.3856902 -0.4682322 -0.5768266 debye
dipolederiv: -0.59557 -0.1249663 -0.1271474 -0.1972787 -0.6498496 0.2034754 -0.1045863 0.1865772 -0.490695 -0.4182425 0.0002058 0.1999813 -0.000769 -0.5826029 -0.1103396 0.2095956 -0.0935611 -0.7437507 -0.5794126 0.0118636 0.2013514 -0.1570577 -0.4175719 0.0984044 0.4367287 -0.0322471 -0.6738882 -0.7000272 0.0634843 -0.173568 0.0794364 -0.4877703 0.2106663 -0.3492157 0.3321361 -0.482842 0.2308516 0.0850182 -0.0146824 0.1881061 0.3853799 -0.1414278 -0.103934 -0.1734003 0.3633392 0.64146 -0.1271568 -0.0274439 -0.1552059 0.3961742 -0.1592187 0.2986035 -0.2806959 0.2510968 0.2999837 0.0508274 -0.1634018 -0.0414 0.2834785 0.119721 -0.1129941 0.0967037 0.5593656 -0.5856583 0.2933075 0.0785786 0.308949 -0.1934328 -0.13194 0.1100125 -0.0639672 -0.1208899 -0.0509942 -0.1186734 -0.0667074 -0.0575449 -0.0569513 -0.08206 -0.0102914 -0.0834572 -0.0853806 0.4509714 -0.0573676 -0.4097631 -0.1130177 0.7348857 0.0344011 -0.786702 0.1176445 0.6719245 0.0301165 0.0173728 0.0709614 0.011117 0.0143737 -0.0381478 0.0582763 -0.0131966 -0.1072299 0.0093855 0.0714712 0.0769161 0.0509981 0.0029795 -0.0551692 0.0242873 -0.033697 -0.0393769 0.1081007 0.0413263 -0.0084117 0.0418357 -0.0937517 0.0619954 -0.0069789 0.0226402 -0.0411035 0.0227417 -0.0934546 -0.0207847 -0.0972242 -0.0620124 -0.0588447 0.0212918 -0.0319306 0.0502992 0.1297862 0.0124426 0.0049556 0.0497835 0.0258293 0.1042635 0.0267414 0.0674666 -0.0692135 0.1041358 0.0434613 -0.020091 -0.0171617 -0.0770581 0.0456139 0.0031149 0.1075828 0.060734 0.0824643 -0.0007818 0.0833924 -0.0049654 0.0927285 -0.0094166 0.0488221 -0.0207354 -0.1209512 -0.210525 0.0215076 -0.0160313 0.0547105 0.056518 -0.0261376 0.0217642 -0.0182241 0.0884115 0.2466371 -0.1664519 0.0417399 -0.0835922 0.0622893 -0.0281782 0.0194771 -0.0768718 0.1457905 0.2410402 -0.028882 0.1714914 0.0566478 0.1488696 -0.031224 0.1387128 -0.0366902 0.2127483 0.3707383 0.0198008 0.102676 0.0290175 0.2845239 -0.0742455 0.0993403 -0.0401758 0.2449798 0.1542681 -0.0220307 0.0434029 0.0441425 -0.2409192 0.0271749 0.0568771 0.0450178 0.0238843 0.017749 0.0076757 -0.0274143 0.0104732 0.3738901 0.0406336 -0.0989431 0.0230814 0.3027475 unknown
polarizability: 93.9199429|-0.5705581|75.8815372|-4.1282234|-3.105941|76.878166 unknown
InChI: InChI=1S/C6H13NO3/c1-4(9)6(10)5(7)2-3-8/h3-6,9-10H,2,7H2,1H3
charge 0 multiplicity 1
23 atoms
O  0.287569 1.37421 -0.883784
O  2.39051 -0.198503 -1.234727
O  -3.058556 -0.29958 1.231654
N  -0.400423 -1.918047 0.798971
C  0.456744 0.271272 0.069734
C  -0.378963 -0.980102 -0.334954
C  1.957247 -0.080733 0.190687
C  -1.815703 -0.56143 -0.857117
C  2.770827 0.989867 0.928969
C  -2.54454 0.227965 0.205216
H  0.092468 0.650702 1.042241
H  0.137116 -1.474359 -1.180051
H  2.043968 -1.065392 0.688038
H  -2.364253 -1.49396 -1.083668
H  -1.701264 0.049007 -1.767731
H  2.612572 1.982906 0.47207
H  2.461171 1.043023 1.988679
H  3.853431 0.75758 0.913941
H  -0.548403 -2.894649 0.525352
H  -1.059152 -1.640705 1.539183
H  0.949518 1.191895 -1.608046
H  -2.550802 1.337305 0.074566
H  3.376818 -0.236073 -1.278524
