program: Gaussian 09
title: 000155077
version: EM64L-G09RevD.01
frameworkgroup: C1[X(C10H18O2)]
method: RPBEPBE
basis: SDD
operation: Freq
keyword: #pfreq=noraman
keyword: PBEPBE/SDD
title: #p freq=noraman PBEPBE/SDD
converged: YES YES NO NO
title: Mulliken charges:
elementType: O O C C C C C C C C C C H H H H H H H H H H H H H H H H H H
charge: -0.496003 -0.452496 0.193356 -0.090823 -0.506967 -0.802749 -0.120239 -0.288863 0.360632 -0.567102 -0.786808 -0.796612 0.242650 0.229125 0.211704 0.222240 0.211871 0.253883 0.267984 0.254556 0.351980 0.350401 0.216965 0.221376 0.233768 0.212739 0.212071 0.223869 0.220443 0.217050
chargesum: 0.00000
title: Mulliken charges with hydrogens summed into heavy atoms:
elementType: O O C C C C C C C C C C
charge: -0.144023 -0.102095 0.193356 0.151827 -0.066138 -0.114756 0.147744 -0.034307 0.360632 -0.128761 -0.128230 -0.135250
polarizability: 1.58275142e+02 2.80382145e-01 1.06049635e+02 4.25931961e+00 -3.48526761e+00 9.30614804e+01
1716.lowfreq: -8.0657 -0.0007 -0.0006 0.0003 5.0277 10.4670 26.2259 50.3745 78.4895
frequency: 26.1909 50.3666 78.4589 89.6687 102.4505 109.9082 172.7658 200.9783 230.0492 246.2917 278.5348 283.9012 299.7080 317.4755 326.9714 361.9760 380.7688 405.5319 436.2839 446.6462 499.0884 520.8722 542.1405 603.7194 691.9504 726.0821 784.7884 844.3737 855.3008 870.4757 917.7213 946.4931 948.3878 972.2034 1001.0630 1006.0661 1030.5004 1032.6121 1050.6026 1076.2999 1081.3137 1104.4543 1127.3738 1158.0682 1210.6044 1231.0258 1238.4281 1280.3653 1292.6778 1301.2382 1327.6388 1358.4033 1375.9896 1387.3899 1388.5368 1397.7340 1421.7937 1448.2138 1456.0809 1465.7332 1469.2431 1471.9703 1475.1307 1488.9550 1649.1277 1695.1118 2954.7088 2961.0648 2962.9895 2988.3197 3024.2754 3028.5097 3036.7124 3054.0304 3075.7888 3080.3911 3088.9583 3095.4101 3102.3992 3106.4852 3115.7993 3199.0788 3473.8256 3573.2626
redmass: 3.0877 2.9921 3.4150 2.1702 3.2404 1.2113 1.2896 2.4107 2.8719 1.6756 3.6489 2.1936 2.0364 1.2188 1.5964 3.3197 2.2727 2.4181 2.3608 3.0192 2.5270 1.2888 2.5573 2.6278 1.9869 4.1060 2.4777 2.4613 1.5458 2.1620 1.9198 1.3973 1.3352 2.2283 1.2824 1.6379 1.3374 1.9232 1.9909 1.6183 1.6649 1.7525 2.1594 1.2917 2.0015 1.4283 3.0613 1.5845 1.3517 1.4367 1.3818 1.4485 1.2405 1.2843 1.2489 1.2221 1.1858 1.0854 1.0529 1.0503 1.0650 1.0497 1.0765 1.0538 4.6402 6.5927 1.0376 1.0431 1.0600 1.0374 1.0969 1.0964 1.0872 1.0922 1.0986 1.0979 1.0953 1.0596 1.0898 1.0974 1.0931 1.1138 1.0641 1.0666
irintensity: 0.2038 0.6561 0.7324 1.4940 2.6171 0.4090 2.4394 2.4213 0.6537 3.9430 8.9213 3.9121 34.4822 70.0019 0.3738 6.4806 3.3303 1.7982 4.6015 3.5913 10.4307 167.7179 36.8497 4.9059 23.3295 45.5374 31.7553 5.9547 12.7007 3.7641 25.6052 1.1294 67.8161 55.9106 10.1472 6.7620 47.9475 34.4810 16.2780 64.5863 2.4031 4.4939 32.9657 18.2017 1.5002 6.8142 10.7843 26.3641 5.6166 29.7885 2.9695 7.8081 41.8317 19.8951 33.9508 7.9642 24.8998 4.2724 0.4431 12.9904 4.4001 24.4091 10.8690 11.0594 7.1551 4.1162 41.1403 58.3631 19.2722 15.4529 10.7560 48.8694 8.6949 33.2110 38.3381 27.2650 33.3472 7.1855 30.5325 18.9074 5.0076 22.2293 24.7190 7.1125
temp: 298.150 k
press: 1.00000 atm
elementType: 8 8 6 6 6 6 6 6 6 6 6 6 1 1 1 1 1 1 1 1 1 1 1 1 1 1 1 1 1 1
symmnumber: 1
zpe: 675831.9 jmol-1
zpe.correction: 0.257411 hartree
zpe.thermalcorrener: 0.272660 hartree
zpe.thermalcorrenthalpy: 0.273604 hartree
zpe.thermalcorrgfe: 0.215087 hartree
zpe.sumelectzpe: -541.286755 hartree
zpe.sumelectthermal: -541.271506 hartree
zpe.sumelectthermalent: -541.270562 hartree
zpe.sumelectthermalfe: -541.329079 hartree
dipole: -1.6739 2.2491 0.2169
dipole: 2.8121
quadrupole: -63.6244 -75.9122 -75.8746
quadrupole: -0.0313 -1.7016 -2.0807
quadrupole: 8.1794 -4.1085 -4.0709 -0.0313 -1.7016 -2.0807
hfenergy: -541.5441657 hartree
pointgroup: C01 [X(C10H18O2)]
dipole: -0.6935847 0.7271111 0.4628838 debye
polarizability: 158.3081599|0.8280234|106.2746926|3.841525|3.1287582|92.8034056 unknown
InChI: InChI=1S/C10H18O2/c1-5-10(4,12)9(11)7-6-8(2)3/h5-6,9,11-12H,1,7H2,2-4H3
charge 0 multiplicity 1
30 atoms
O  -2.043458 -1.054763 1.345861
O  -0.51128 -1.736101 -0.733891
C  -1.901691 0.017947 0.293586
C  -0.504272 -0.317877 -0.338641
C  0.69885 -0.015728 0.592742
C  -1.956128 1.395022 0.969553
C  -2.987303 -0.214735 -0.749298
C  2.012083 -0.40771 -0.054582
C  3.184769 0.289683 -0.051553
C  -4.005224 0.62677 -1.059162
C  4.415108 -0.259516 -0.75836
C  3.398257 1.630017 0.631919
H  -0.39775 0.241296 -1.285177
H  0.542452 -0.579956 1.53665
H  0.69935 1.057031 0.856755
H  -1.665991 2.198746 0.268031
H  -2.973438 1.614938 1.340991
H  -1.274407 1.417992 1.834547
H  -2.887133 -1.173996 -1.276328
H  1.979896 -1.373559 -0.578752
H  -3.001984 -1.136356 1.58085
H  -0.859791 -2.222929 0.063199
H  -4.739999 0.361102 -1.827531
H  -4.131184 1.60546 -0.581807
H  4.209828 -1.231113 -1.239845
H  4.773004 0.442359 -1.538635
H  5.255809 -0.39757 -0.048714
H  2.487326 2.023164 1.112324
H  4.180948 1.54841 1.412814
H  3.756954 2.386671 -0.094446
