program: Gaussian 09
title: 000160105
version: EM64L-G09RevD.01
frameworkgroup: C1[X(C10H15N6O3P)]
method: RPBEPBE
basis: SDD
operation: Freq
keyword: #p
keyword: freq=noraman
keyword: PBEPBE/SDD
title: #p freq=noraman PBEPBE/SDD
converged: YES YES NO NO
title: Mulliken charges:
elementType: P O O O N N N N N N C C C C C C C C C C H H H H H H H H H H H H H H H
charge: 1.254662 -0.584644 -0.235255 -0.257582 -0.408792 -0.461098 -0.814306 -0.415510 0.018328 -0.062488 -0.394721 -0.408215 -0.365960 -0.414554 0.369542 0.025766 -0.342341 -0.351647 0.335713 -0.530622 0.245356 0.307359 0.282026 0.243213 0.249574 0.247976 0.283571 0.249699 0.366500 0.333644 0.259657 0.265161 0.230200 0.252598 0.227190
chargesum: 0.00000
title: Mulliken charges with hydrogens summed into heavy atoms:
elementType: P O O O N N N N N N C C C C C C C C C C
charge: 1.254662 -0.584644 -0.235255 -0.257582 -0.408792 -0.461098 -0.447806 -0.081866 0.018328 -0.062488 0.157994 0.117024 0.131590 0.118716 0.369542 0.025766 -0.082684 -0.086486 0.335713 0.179366
polarizability: 2.89423745e+02 -8.96179286e+00 1.81810688e+02 -8.21244545e-01 3.02090273e-01 1.14112664e+02
1716.lowfreq: -6.6832 -3.8741 -2.0213 -0.0009 0.0005 0.0010 18.5476 28.2281 32.2141
frequency: 18.1955 28.0343 32.1559 39.9275 57.7967 70.9607 96.9089 104.5845 111.5671 130.5268 152.1424 160.6053 177.2177 195.2327 205.2742 224.5573 232.4275 285.9986 310.7600 337.0510 347.7551 379.7853 386.2166 416.4143 430.3301 458.2956 499.8475 513.0453 545.4021 567.1859 609.3610 616.9546 634.0626 695.9114 717.9596 769.7162 773.0870 787.7610 789.3181 792.6981 807.2366 817.6840 878.9599 883.6525 887.8528 891.7816 927.1135 958.6212 993.6651 998.0175 1001.7608 1010.7436 1027.2111 1076.0606 1081.8867 1111.8630 1112.6581 1117.8031 1119.0252 1133.1095 1137.5026 1152.1549 1157.0131 1162.8746 1201.9087 1233.3323 1237.5332 1242.2528 1276.3798 1347.3039 1355.2990 1366.9027 1425.9173 1444.1530 1452.2429 1460.5918 1466.3370 1469.9116 1470.3116 1478.9254 1481.4727 1517.4136 1569.3787 1648.6219 2967.0363 3058.6173 3077.9401 3078.1341 3084.5203 3086.9321 3134.8828 3147.7664 3155.8062 3184.9759 3186.8295 3202.2727 3204.2785 3514.6479 3534.5877
redmass: 4.6511 4.2779 5.7755 4.0075 2.9798 5.0233 4.4787 4.2727 6.9337 3.9895 4.4323 5.1062 5.4678 4.7708 4.0041 1.2561 4.0737 5.1621 4.6365 5.2829 5.6165 5.1567 6.6737 4.3771 6.1132 5.1341 5.1118 2.3542 2.3525 4.2074 2.9727 6.5894 1.3274 9.1535 7.1555 7.7927 7.9013 6.1353 6.7481 6.8690 1.2177 1.1381 4.6645 4.6925 4.6745 1.6432 1.4041 8.6164 1.0774 3.6211 1.1328 6.6256 5.5669 1.2714 1.2811 1.2575 1.3239 1.3164 1.3393 1.2810 1.8089 1.3988 1.4831 1.3942 3.1070 2.7636 3.1442 3.3400 3.2540 1.9064 2.1076 1.9994 1.7972 1.6926 1.0782 1.0943 1.0500 1.1606 1.0932 1.8028 1.6666 3.4738 5.6367 7.5750 1.0326 1.1045 1.0494 1.0502 1.0609 1.0587 1.0999 1.0921 1.0934 1.1180 1.1193 1.1175 1.1183 1.0769 1.0760
irintensity: 2.2043 0.1791 1.0076 0.7711 3.2221 0.5349 6.7664 8.8687 2.3807 4.1754 6.5183 0.7743 10.1690 18.2471 10.1032 0.3390 1.2475 5.8023 1.4121 3.0973 6.4133 3.8585 8.3311 0.6449 36.9460 28.0848 54.5746 5.2385 13.4389 21.4310 46.0618 70.1206 171.2818 107.4202 48.6287 23.5333 11.2585 16.3954 14.7581 22.9961 12.3747 27.1616 75.8147 108.5487 242.1972 22.6014 7.8160 64.5590 3.1251 15.4049 1.3564 62.4025 49.2498 2.1521 9.8227 0.1125 7.8852 4.8404 9.2269 55.2445 139.9081 1.4634 130.6539 0.7834 108.1354 141.8246 68.2304 38.5808 111.3864 163.5010 116.2918 566.5189 76.5877 13.7311 7.0281 2.8220 15.6550 34.7993 65.2577 578.5314 551.3055 126.1827 1.5376 165.9116 56.4252 41.2350 18.5929 5.2134 28.9449 33.9117 25.5583 17.2341 15.5930 2.6774 9.2658 12.0380 5.5429 28.6548 51.4774
temp: 298.150 k
press: 1.00000 atm
elementType: 15 8 8 8 7 7 7 7 7 7 6 6 6 6 6 6 6 6 6 6 1 1 1 1 1 1 1 1 1 1 1 1 1 1 1
symmnumber: 1
zpe: 687342.6 jmol-1
zpe.correction: 0.261795 hartree
zpe.thermalcorrener: 0.282654 hartree
zpe.thermalcorrenthalpy: 0.283599 hartree
zpe.thermalcorrgfe: 0.209177 hartree
zpe.sumelectzpe: -1283.847098 hartree
zpe.sumelectthermal: -1283.826239 hartree
zpe.sumelectthermalent: -1283.825295 hartree
zpe.sumelectthermalfe: -1283.899717 hartree
dipole: -1.9901 -0.1024 -2.9595
dipole: 3.5678
quadrupole: -81.9222 -112.8207 -134.8118
quadrupole: -13.7086 -5.1457 -1.0966
quadrupole: 27.9293 -2.9691 -24.9602 -13.7086 -5.1457 -1.0966
hfenergy: -1284.1088934 hartree
pointgroup: C01 [X(C10H15N6O3P1)]
dipole: 0.7883749 -0.0002669 -1.1613778 debye
polarizability: 287.937423|-15.4067458|183.2908362|1.3701248|0.0029103|114.1188386 unknown
InChI: InChI=1S/C10H15N6O3P/c1-19-8-6-11-9(12-7-8)13-10(17)14-20(18,15-2-3-15)16-4-5-16/h6-7,13-14H,2-5H2,1H3
charge 0 multiplicity 1
35 atoms
P  -3.226736 0.228655 0.348481
O  -3.521177 0.12767 1.921501
O  -0.403172 -1.004459 0.846943
O  6.110181 -0.163709 0.138896
N  -3.6481 -1.195788 -0.648615
N  -4.050747 1.563064 -0.524198
N  -1.610493 0.742442 -0.142594
N  0.705007 0.921527 0.006128
N  2.416876 -0.760549 -0.009055
N  2.919125 1.625167 0.077471
C  -2.873044 -2.497645 -0.457789
C  -4.279184 -2.374694 0.087133
C  -5.563088 1.547811 -0.590458
C  -4.86199 2.532875 0.324168
C  -0.423136 0.116671 0.280324
C  2.059265 0.54807 0.038851
C  3.755737 -1.027726 0.029409
C  4.24211 1.339234 0.097344
C  4.727561 0.001985 0.093408
C  6.620562 -1.542599 0.142769
H  -2.700939 -3.029222 -1.398863
H  -2.036475 -2.491033 0.249556
H  -4.393591 -2.277035 1.173831
H  -5.120119 -2.823764 -0.450119
H  -5.966458 1.877523 -1.55223
H  -6.099074 0.714244 -0.120524
H  -4.896428 2.33746 1.403282
H  -4.75605 3.579098 0.023491
H  -1.599261 1.501554 -0.83151
H  0.574622 1.931927 -0.09027
H  4.026815 -2.087921 -0.00327
H  4.944246 2.17889 0.119883
H  6.248807 -2.101721 1.022664
H  7.713508 -1.440933 0.19863
H  6.339439 -2.074369 -0.786467
