program: Gaussian 09
title: 000160154
version: EM64L-G09RevD.01
frameworkgroup: C1[X(C20H22N2O2)]
method: RPBEPBE
basis: SDD
operation: Freq
keyword: #p
keyword: freq=noraman
keyword: PBEPBE/SDD
title: #p freq=noraman PBEPBE/SDD
converged: YES YES NO NO
title: Mulliken charges:
elementType: O O N N C C C C C C C C C C C C C C C C C C C C H H H H H H H H H H H H H H H H H H H H H H
charge: -0.418882 -0.232707 -0.063689 -0.306374 0.362254 -0.306151 -0.478400 0.149530 -0.375728 -0.421898 -0.453733 -0.452186 0.117895 -0.401295 -0.541701 0.222327 0.170276 0.200090 -0.726373 -0.436285 -0.293827 0.065500 -0.251558 -0.252704 0.251965 0.220381 0.230416 0.200716 0.216331 0.200273 0.215328 0.199213 0.230472 0.228280 0.225959 0.279088 0.223874 0.229324 0.231006 0.222429 0.219372 0.235490 0.239146 0.220721 0.218969 0.386864
chargesum: 0.00000
title: Mulliken charges with hydrogens summed into heavy atoms:
elementType: O O N N C C C C C C C C C C C C C C C C C C C C
charge: -0.032018 -0.232707 -0.063689 -0.306374 0.362254 -0.054186 -0.027603 0.149530 0.041318 -0.006297 -0.024048 0.002054 0.117895 -0.122206 -0.088503 0.222327 0.170276 0.200090 -0.053566 -0.200795 -0.054681 0.065500 -0.030837 -0.033735
polarizability: 3.09324959e+02 -1.29607098e+01 2.51756103e+02 4.00805437e+00 8.91253646e+00 1.51789793e+02
1716.lowfreq: -0.0007 0.0003 0.0008 3.9504 8.3197 12.5834 38.6693 62.0061 67.7550
frequency: 38.6565 61.9838 67.7199 81.6626 97.5176 122.9693 149.9341 170.5134 177.0374 185.9191 207.9601 227.7086 247.2441 266.9003 278.2050 305.2631 321.1777 344.5000 347.7592 356.9373 380.0946 426.1290 433.5785 448.5354 468.8118 471.7946 513.6891 531.0751 553.9058 563.5000 572.2343 588.9736 594.0631 624.9011 630.0356 649.6909 686.3707 713.5480 733.3013 745.6904 751.5801 756.1505 773.3238 784.4927 791.3248 847.2651 852.2352 861.0593 891.4686 908.0725 909.6782 921.6066 928.3241 943.9954 958.1318 969.6127 982.9510 998.4128 1021.2587 1023.8954 1037.9033 1042.2911 1050.2872 1072.2617 1089.3252 1102.4379 1113.2214 1123.9638 1137.5308 1145.3232 1163.8948 1174.7362 1183.8423 1186.3007 1209.7082 1220.9630 1240.6088 1258.9181 1278.6547 1283.1714 1289.9655 1295.8079 1303.6892 1314.6800 1321.0814 1328.1961 1331.1107 1332.5808 1343.0098 1351.9779 1375.4431 1394.4810 1401.2758 1403.5204 1427.3677 1452.9319 1453.7805 1459.0561 1462.1989 1465.9958 1468.6791 1472.2829 1478.8459 1479.9422 1489.0081 1576.8182 1595.8492 1610.4809 1630.6312 1634.4685 2883.0088 2956.4267 2962.4679 2976.3911 2980.6582 2981.5458 2987.1896 3000.1588 3010.3895 3019.4221 3039.8615 3045.5269 3054.6453 3064.0019 3073.4857 3077.9483 3124.4327 3137.1959 3148.8884 3157.1706 3191.8352 3515.7111
redmass: 4.7047 6.1165 3.3098 3.7064 3.2207 3.2442 3.1288 4.4941 3.1356 2.6023 2.9473 2.5941 3.4438 1.7246 4.0045 4.4328 3.5458 3.7147 2.3799 2.9938 4.1487 2.9688 3.3375 3.9825 3.5330 2.8663 3.4689 4.5927 3.6038 2.9580 3.6640 4.1890 1.9296 3.0061 3.8954 4.4744 4.3086 4.5823 3.0680 1.4241 3.8908 3.4914 3.0388 1.5331 2.2475 1.4390 1.7179 1.6627 3.0160 2.7480 2.4919 2.3619 1.4163 2.5060 3.4099 1.3184 3.7459 2.3366 2.1191 2.0907 1.8860 2.1490 2.2405 2.6140 2.2628 2.2398 2.9595 2.0745 1.7671 2.2060 1.3874 1.8490 1.3863 1.4898 1.5932 1.6047 1.9411 1.3655 1.9192 1.3551 1.4356 1.3425 1.8805 1.7805 1.5937 1.6754 1.3890 1.5368 1.4079 1.3754 1.4059 2.5210 1.3427 4.1090 5.7038 1.1508 2.9777 1.0862 1.0943 1.1352 1.0984 3.0879 1.0887 1.0534 1.0463 6.5727 8.5475 8.1188 8.2389 8.8303 1.0688 1.0814 1.0619 1.0627 1.0414 1.0565 1.0642 1.0648 1.0940 1.0874 1.1003 1.0972 1.1051 1.1017 1.0985 1.1002 1.0852 1.0911 1.0905 1.0980 1.0944 1.0641
irintensity: 0.3414 0.5771 0.1052 0.4678 0.0677 0.4532 2.6371 0.0745 2.2720 0.4094 0.9078 0.8883 0.3498 0.1054 1.3300 1.9072 0.6576 2.0520 1.0673 3.4774 1.0990 6.1094 1.5672 2.6939 1.4162 1.9004 17.5882 19.7985 7.8481 21.7773 5.0741 7.7417 68.0293 38.8157 19.1341 4.3025 2.0431 26.3160 2.7425 75.6038 1.3721 6.2086 1.9498 7.3321 0.8178 5.8440 11.7160 10.9509 6.1782 5.5700 8.9240 6.2385 0.1283 15.4353 21.1802 0.3065 4.1868 20.1881 45.6238 16.4264 3.3272 101.3975 19.6961 1.7324 29.7681 69.4771 16.2574 15.0812 38.3039 23.6546 3.4159 3.8974 15.3534 2.3232 6.2123 10.2902 10.5103 6.9868 39.8401 6.3107 7.5571 6.8346 7.0675 23.1545 5.3601 10.7714 0.8052 0.6228 5.2536 3.8821 4.5691 6.8492 25.0298 7.3441 241.5748 10.1374 104.6143 20.0515 17.6310 7.5582 5.5249 35.8894 1.1828 6.9561 12.8954 11.2682 172.2577 4.8850 59.1930 106.4662 54.6931 16.5680 40.3984 32.0911 30.8821 14.1698 45.0696 28.4017 45.8531 64.1820 36.4265 6.0062 43.3341 42.4724 63.4249 48.7470 0.7042 18.2409 1.4354 41.2103 10.9131 45.5581
temp: 298.150 k
press: 1.00000 atm
elementType: 8 8 7 7 6 6 6 6 6 6 6 6 6 6 6 6 6 6 6 6 6 6 6 6 1 1 1 1 1 1 1 1 1 1 1 1 1 1 1 1 1 1 1 1 1 1
symmnumber: 1
zpe: 997154.4 jmol-1
zpe.correction: 0.379796 hartree
zpe.thermalcorrener: 0.399670 hartree
zpe.thermalcorrenthalpy: 0.400614 hartree
zpe.thermalcorrgfe: 0.332924 hartree
zpe.sumelectzpe: -1033.536183 hartree
zpe.sumelectthermal: -1033.516310 hartree
zpe.sumelectthermalent: -1033.515365 hartree
zpe.sumelectthermalfe: -1033.583055 hartree
dipole: -1.1733 -1.4354 -0.2392
dipole: 1.8693
quadrupole: -134.2400 -137.9540 -142.3831
quadrupole: 3.9440 -1.3591 -3.9044
quadrupole: 3.9524 0.2383 -4.1907 3.9440 -1.3591 -3.9044
hfenergy: -1033.9159795 hartree
pointgroup: C01 [X(C20H22N2O2)]
dipole: 0.4610892 -0.5687316 0.0695563 debye
polarizability: 308.9337081|12.8432619|252.5315777|8.8079361|-2.1475668|151.4055686 unknown
InChI: InChI=1S/C20H22N2O2/c1-2-20-9-5-10-21-11-8-14-13-6-3-4-7-15(13)22(17(14)18(20)21)16(12-20)19(23)24/h3-4,6-7,12,18,23H,2,5,8-11H2,1H3
charge 0 multiplicity 1
46 atoms
O  -1.990212 2.938208 1.085817
O  -0.489493 4.215146 -0.140165
N  2.240738 -1.790344 0.352294
N  -0.710808 0.538606 0.19354
C  2.207907 0.732479 -0.159296
C  1.608807 -0.465976 0.65696
C  2.31431 0.337669 -1.677367
C  0.117265 -0.576085 0.460026
C  2.325803 -2.112846 -1.09874
C  3.05691 -1.001429 -1.869833
C  3.618908 1.127103 0.382511
C  1.540288 -2.863021 1.119273
C  -0.61782 -1.747115 0.460312
C  1.260082 1.916483 -0.060929
C  0.038764 -3.083602 0.711573
C  -0.103272 1.817961 0.085849
C  -1.984157 -1.382526 0.124916
C  -2.024829 0.050788 -0.056238
C  3.653983 1.668612 1.828806
C  -3.160338 -2.147347 -0.071192
C  -3.207335 0.702415 -0.463292
C  -0.852323 3.090359 0.282799
C  -4.345559 -1.493185 -0.462679
C  -4.362156 -0.084908 -0.664144
H  1.817724 -0.266801 1.728454
H  2.818571 1.156113 -2.224881
H  1.294472 0.246472 -2.100635
H  1.319373 -2.255096 -1.563102
H  2.871021 -3.071637 -1.188243
H  3.084446 -1.260756 -2.945339
H  4.103034 -0.927544 -1.521089
H  4.038372 1.894401 -0.300121
H  4.278867 0.243372 0.318694
H  1.585447 -2.586026 2.18987
H  2.105046 -3.805405 0.993814
H  1.679027 2.927191 -0.113067
H  -0.473643 -3.640432 1.521034
H  -0.028539 -3.72272 -0.192844
H  2.979731 2.53433 1.962356
H  3.364151 0.898111 2.565897
H  4.677091 1.996966 2.08794
H  -3.142635 -3.234108 0.068349
H  -3.245867 1.781742 -0.617409
H  -5.262521 -2.071205 -0.622566
H  -5.290756 0.403144 -0.980887
H  -2.403173 3.833843 1.223768
