program: Gaussian 09
title: 000013982
version: EM64L-G09RevD.01
frameworkgroup: C1[X(C22H28N2O3)]
method: RPBEPBE
basis: SDD
operation: Freq
keyword: #p
keyword: freq=noraman
keyword: PBEPBE/SDD
title: #p freq=noraman PBEPBE/SDD
converged: NO YES NO NO
title: Mulliken charges:
elementType: O O O N N C C C C C C C C C C C C C C C C C C C C C C H H H H H H H H H H H H H H H H H H H H H H H H H H H H
charge: -0.214172 -0.181041 -0.218543 -0.243380 -0.345280 -0.026809 -0.390946 -0.444884 -0.446174 0.027475 -0.411379 -0.414296 -0.434200 -0.425402 -0.383888 0.174425 -0.402248 -0.398393 -0.393647 0.116441 0.190964 0.521938 -0.338539 -0.338612 -0.219910 -0.213826 -0.235177 0.225244 0.294164 0.242736 0.204473 0.230256 0.232478 0.209095 0.206256 0.193424 0.194244 0.205775 0.240920 0.200021 0.199681 0.245626 0.203449 0.193051 0.202396 0.196718 0.196868 0.202830 0.200592 0.199371 0.236992 0.241728 0.229645 0.229783 0.231688
chargesum: 0.00000
title: Mulliken charges with hydrogens summed into heavy atoms:
elementType: O O O N N C C C C C C C C C C C C C C C C C C C C C C
charge: -0.214172 -0.181041 -0.218543 -0.243380 -0.345280 0.198435 -0.096783 -0.010155 -0.004601 0.270212 -0.011699 -0.014278 0.006741 0.019905 0.012612 0.174425 -0.003134 0.001305 0.006316 0.116441 0.190964 0.521938 -0.101547 -0.096884 0.009734 0.015957 -0.003489
polarizability: 2.98609887e+02 9.46989456e+00 2.73183735e+02 1.06572618e+01 1.83405233e+00 1.85846902e+02
1716.lowfreq: -12.0768 -5.5622 -0.0004 0.0004 0.0005 7.6582 19.6929 25.0977 27.8734
frequency: 17.4391 24.9595 27.8497 33.5567 44.4723 58.6893 65.7675 91.7473 107.3822 124.8689 142.5066 159.5725 171.7812 201.0923 205.0585 216.1720 219.7080 238.0345 272.3312 295.7457 302.1157 333.1131 335.0915 380.4864 406.5051 412.2514 422.5219 425.8260 430.7832 438.7379 448.0991 449.8648 473.6952 502.0641 515.4750 549.5468 569.0716 613.9298 615.3222 663.1786 692.4472 695.4015 712.3977 725.7191 740.5124 766.1424 776.3182 781.5988 789.8526 802.6614 832.7209 838.8226 842.2306 857.4865 888.4013 889.7918 899.5397 904.4111 914.6346 919.7026 922.9397 936.4019 970.0117 984.9338 990.5521 992.1237 995.1069 1018.6883 1027.0832 1046.1510 1053.5631 1056.1866 1061.5995 1062.9564 1073.5814 1076.9314 1081.3069 1089.8830 1110.9540 1113.0559 1122.6032 1137.5637 1162.8670 1173.1874 1181.7415 1190.1224 1198.6183 1199.6377 1217.1254 1247.8636 1256.3979 1258.0223 1258.9334 1263.7404 1270.1818 1275.1087 1282.2470 1306.6523 1308.2708 1313.9730 1315.0609 1317.5163 1329.6966 1333.9264 1336.2841 1337.2661 1340.9759 1342.2426 1344.2596 1347.6575 1351.5969 1365.2248 1385.7472 1386.9386 1440.8586 1456.8445 1461.8832 1462.4630 1462.9981 1464.4079 1468.1587 1469.1335 1473.7625 1475.6821 1481.3142 1484.8436 1586.8588 1601.8409 1609.0978 1611.1202 1650.0414 2953.0450 2964.9836 2967.0511 2968.6567 2969.3613 2970.3169 2973.2720 2974.8906 2981.9851 2990.1509 2994.0179 3027.0765 3031.1300 3031.5679 3031.8412 3033.1672 3040.5356 3042.1193 3047.0674 3053.8369 3061.8211 3071.0406 3071.5637 3132.1687 3141.0528 3152.1709 3161.5873 3172.9362
redmass: 3.1770 3.6232 4.2471 4.5312 4.2225 4.1917 4.8201 4.3144 3.0889 6.1094 7.0896 5.1499 6.3746 3.2160 2.8577 2.4251 1.8962 4.8671 4.7212 5.2669 2.2765 2.4936 2.5105 4.4518 2.7933 2.6789 4.2854 3.6567 4.3267 4.0222 4.0660 3.5897 1.9888 3.2700 2.0923 3.5862 5.0157 6.5074 7.2776 6.4912 3.4671 2.6043 4.4251 6.1510 4.0927 2.3268 2.5180 1.5843 1.4332 2.4474 3.1977 1.2612 2.0390 1.6644 1.5042 2.0062 1.7277 1.9938 1.6465 1.9870 1.7433 2.8508 1.3956 2.3732 3.9113 4.2764 1.5474 3.5367 2.0964 1.8017 1.8027 1.5001 1.3100 2.4133 1.9500 1.3802 1.5913 2.1393 2.5841 2.4808 2.0267 4.8819 2.5956 1.0526 1.1333 1.5284 1.6760 1.6198 2.7188 1.3428 1.2875 1.2230 1.2752 1.4124 1.4189 1.2982 1.8818 1.4951 1.3495 1.2773 1.4094 3.4132 1.4094 1.3543 1.3765 1.5039 1.5979 1.4981 1.5495 1.4848 1.3653 1.4220 4.2717 2.0128 2.2478 1.0898 1.0924 1.0876 1.0882 1.0887 1.0837 1.0841 1.0872 1.0970 2.3619 1.0921 10.8496 7.3333 6.9572 7.8688 11.7669 1.0814 1.0645 1.0652 1.0628 1.0631 1.0618 1.0624 1.0628 1.0640 1.0620 1.0629 1.0861 1.0974 1.0989 1.0953 1.0947 1.1005 1.1032 1.0993 1.1004 1.1016 1.0987 1.0862 1.0850 1.0885 1.0931 1.0973 1.1017
irintensity: 0.0765 0.0720 0.4671 0.6725 0.1120 0.9734 0.7317 0.5774 0.8932 0.9013 3.7315 1.2969 5.3383 0.0931 2.4255 2.6517 0.6304 6.7510 0.5164 8.5671 2.7096 4.3194 1.9486 0.6551 0.2244 0.8474 0.2915 0.5750 0.4712 3.8353 1.2179 17.8975 1.3013 7.1133 1.5753 21.7177 46.6205 0.5512 3.8415 8.9945 9.4682 30.4688 13.9272 12.4279 15.6101 10.5008 11.4557 2.0161 0.5370 1.2766 1.4017 0.1332 6.0631 1.7378 11.3165 3.3451 17.0415 4.5876 0.6629 0.5640 0.0059 1.0618 0.0776 31.6619 1.0962 6.9431 1.8335 34.7888 12.1946 2.1085 5.9617 1.5109 4.1931 7.3825 28.1799 3.0696 4.4298 17.4465 0.5456 0.7672 30.7977 106.8990 2.3711 0.0273 5.0424 30.1537 13.4605 7.4255 24.0625 3.1538 1.7698 6.7435 2.3977 20.0551 6.9331 10.5552 166.6616 83.3418 3.3578 1.7276 26.1623 380.8256 15.1973 1.0352 1.5964 26.3240 14.2597 6.0127 3.1293 16.6244 5.3137 3.0346 11.2659 53.3939 6.0440 1.2444 6.2073 7.0595 4.9901 7.3865 3.3032 27.3651 15.3950 0.7862 46.5221 3.6294 440.3960 76.0214 63.9961 165.6557 26.1454 5.7195 29.4794 27.8044 28.3946 43.8720 33.8893 34.1755 8.8090 27.8549 49.8493 21.6091 25.1509 49.4744 68.9265 74.1550 50.0752 31.1661 44.1855 26.1223 69.1381 2.1759 31.7121 13.9345 0.6018 2.9455 30.0039 23.1905 10.5879
temp: 298.150 k
press: 1.00000 atm
elementType: 8 8 8 7 7 6 6 6 6 6 6 6 6 6 6 6 6 6 6 6 6 6 6 6 6 6 6 1 1 1 1 1 1 1 1 1 1 1 1 1 1 1 1 1 1 1 1 1 1 1 1 1 1 1 1
symmnumber: 1
zpe: 1214641.4 jmol-1
zpe.correction: 0.462632 hartree
zpe.thermalcorrener: 0.487053 hartree
zpe.thermalcorrenthalpy: 0.487997 hartree
zpe.thermalcorrgfe: 0.406389 hartree
zpe.sumelectzpe: -1188.355527 hartree
zpe.sumelectthermal: -1188.331107 hartree
zpe.sumelectthermalent: -1188.330163 hartree
zpe.sumelectthermalfe: -1188.411771 hartree
dipole: 0.3651 0.5585 -1.9759
dipole: 2.0855
quadrupole: -153.5598 -148.2665 -171.1234
quadrupole: 0.4057 3.9132 -8.0308
quadrupole: 4.0901 9.3834 -13.4735 0.4057 3.9132 -8.0308
hfenergy: -1188.8181599 hartree
pointgroup: C01 [X(C22H28N2O3)]
dipole: 0.1393549 0.1930326 -0.7851838 debye
polarizability: 300.2079721|7.8833483|272.03542|7.8552985|-0.9027423|185.3971316 unknown
InChI: InChI=1S/C22H28N2O3/c25-20-19(16-10-4-1-5-11-16)21(26)24(18-14-8-3-9-15-18)22(27)23(20)17-12-6-2-7-13-17/h2,6-7,12-13,16,18-19H,1,3-5,8-11,14-15H2
charge 0 multiplicity 1
55 atoms
O  2.326617 0.644056 1.692767
O  -2.273147 0.771079 1.918628
O  -0.195343 -2.029537 -1.207067
N  1.140615 -0.642906 0.134156
N  -1.286999 -0.60881 0.299206
C  -0.022227 2.384353 0.084431
C  0.018002 1.280216 1.227323
C  -1.230316 3.337109 0.284857
C  1.300385 3.19359 0.044464
C  2.368659 -1.388846 -0.331324
C  -1.27193 4.434391 -0.806245
C  1.255617 4.294811 -1.043043
C  3.435806 -0.446239 -0.93418
C  2.946782 -2.285635 0.791874
C  0.046988 5.23838 -0.850542
C  1.253183 0.4042 1.077598
C  4.623853 -1.283021 -1.472098
C  4.14446 -3.104514 0.250533
C  5.224534 -2.184005 -0.365813
C  -1.270646 0.47737 1.222032
C  -0.115268 -1.13006 -0.332586
C  -2.554202 -1.282051 0.027137
C  -3.6009 -0.561504 -0.585834
C  -2.726741 -2.632951 0.396227
C  -4.83486 -1.201738 -0.831243
C  -3.959992 -3.270062 0.141547
C  -5.016509 -2.556583 -0.470438
H  -0.141411 1.861264 -0.889637
H  0.09058 1.800544 2.196978
H  1.993938 -2.044195 -1.138837
H  -1.145574 3.814171 1.282939
H  -2.181485 2.774043 0.290757
H  2.163526 2.527931 -0.137384
H  1.466954 3.658682 1.037519
H  -2.130032 5.107966 -0.618669
H  -1.445995 3.96315 -1.796188
H  1.190428 3.818945 -2.043877
H  2.201787 4.869064 -1.024595
H  3.801037 0.253763 -0.161709
H  2.984974 0.150685 -1.750834
H  2.157672 -2.966263 1.16615
H  3.274109 -1.65136 1.635237
H  0.012651 5.989394 -1.663021
H  0.16636 5.796694 0.100792
H  5.39858 -0.604355 -1.877438
H  4.281015 -1.918304 -2.315083
H  3.787395 -3.816328 -0.522444
H  4.577198 -3.7110 1.068914
H  6.052278 -2.792064 -0.778882
H  5.658302 -1.544608 0.430126
H  -3.454067 0.488112 -0.860661
H  -1.905022 -3.18077 0.868157
H  -5.650583 -0.644183 -1.303702
H  -4.09557 -4.319826 0.422691
H  -5.973863 -3.052543 -0.664069
