program: Gaussian 09
title: 000160014
version: EM64L-G09RevD.01
frameworkgroup: C1[X(C7H12N2S)]
method: RPBEPBE
basis: SDD
operation: Freq
keyword: #p
keyword: freq=noraman
keyword: PBEPBE/SDD
title: #p freq=noraman PBEPBE/SDD
converged: YES YES NO NO
title: Mulliken charges:
elementType: S N N C C C C C C C H H H H H H H H H H H H
charge: -0.056170 -0.085371 -0.092872 -0.343547 -0.347463 -0.202529 -0.191677 -0.204735 -0.677010 -0.610193 0.205691 0.247913 0.199439 0.242703 0.263162 0.260806 0.204053 0.223608 0.222486 0.234572 0.272349 0.234783
chargesum: 0.00000
title: Mulliken charges with hydrogens summed into heavy atoms:
elementType: S N N C C C C C C C
charge: -0.056170 -0.085371 -0.092872 0.110057 0.094679 -0.202529 0.071485 0.056072 -0.026863 0.131512
polarizability: 1.23074327e+02 -3.85928577e+00 1.21217860e+02 6.98444280e+00 -3.97124700e-01 6.36071239e+01
1716.lowfreq: -13.6945 -8.2022 -1.4643 0.0009 0.0013 0.0027 38.3811 68.9303 79.4669
frequency: 37.8842 68.9219 79.4247 81.4970 167.2601 227.5487 236.0270 247.5234 285.1401 291.4627 360.7654 471.0079 518.4811 598.6193 635.9919 658.4274 689.1260 746.0119 765.1288 801.8041 873.1438 892.1181 996.6602 1020.2922 1054.2128 1070.5010 1105.4436 1113.6913 1129.2417 1161.1029 1208.5410 1231.0021 1279.9678 1300.1331 1320.2277 1328.7516 1360.0356 1391.7640 1394.1368 1396.3442 1445.6823 1457.2965 1474.5736 1478.1862 1481.4061 1484.1713 1486.5099 1561.8441 2976.9204 2983.1503 2986.4529 2998.2346 3039.0809 3062.6370 3078.6939 3079.7225 3082.9518 3089.7933 3240.2801 3269.0853
redmass: 3.4384 1.8441 1.3907 1.7862 3.8421 1.3881 4.2142 2.5711 2.5762 2.9641 4.7621 3.0649 7.7644 3.7004 3.7734 2.7573 1.8679 1.2064 3.3832 1.3501 1.2357 1.8595 3.3321 2.2694 2.7934 1.7166 1.3442 2.1999 1.3086 2.7073 1.7244 1.7115 1.3272 1.4666 2.7386 3.1945 1.4486 3.1548 1.2886 1.9497 1.3630 1.1564 1.0572 1.1050 1.0493 1.0429 1.0702 4.8142 1.0362 1.0331 1.0606 1.0601 1.0988 1.1029 1.1023 1.1028 1.1002 1.1006 1.0909 1.1111
irintensity: 1.8716 1.7686 1.0809 0.1879 1.1050 1.5143 5.1198 4.9738 3.5753 1.1034 3.3289 4.9985 5.5931 0.1676 13.5020 28.1175 53.3411 12.9591 14.0835 0.2289 0.9996 14.5675 2.1937 1.7874 0.1750 15.7249 16.0384 5.1105 0.5641 48.5473 60.9121 35.9395 2.5248 1.6231 2.0455 48.9515 12.6261 121.0461 30.2008 21.8614 51.0504 33.8434 3.0711 37.1976 8.9637 14.5540 19.4581 0.1844 37.8975 75.4083 12.9369 57.3355 0.2441 2.2917 53.2767 26.0880 42.1996 0.3878 2.3036 0.1228
temp: 298.150 k
press: 1.00000 atm
elementType: 16 7 7 6 6 6 6 6 6 6 1 1 1 1 1 1 1 1 1 1 1 1
symmnumber: 1
zpe: 480611.9 jmol-1
zpe.correction: 0.183055 hartree
zpe.thermalcorrener: 0.194191 hartree
zpe.thermalcorrenthalpy: 0.195135 hartree
zpe.thermalcorrgfe: 0.144981 hartree
zpe.sumelectzpe: -780.739796 hartree
zpe.sumelectthermal: -780.728661 hartree
zpe.sumelectthermalent: -780.727716 hartree
zpe.sumelectthermalfe: -780.777870 hartree
dipole: 0.3656 -4.8046 0.3385
dipole: 4.8304
quadrupole: -55.1743 -71.3408 -70.4456
quadrupole: -2.4145 2.8396 1.1450
quadrupole: 10.4793 -5.6872 -4.7921 -2.4145 2.8396 1.1450
hfenergy: -780.9228513 hartree
pointgroup: C01 [X(C7H12N2S1)]
dipole: -0.1687185 1.8874902 0.1432203 debye
dipolederiv: -0.4437638 0.0624466 0.0141475 0.0536374 -0.9375264 -0.0324532 0.0106854 -0.0206727 -0.3070542 -0.7554507 -0.3478185 0.0477191 0.1870803 -0.634263 -0.0235079 0.1048744 0.1191674 -0.1227301 -0.7291154 0.3603999 0.1211911 -0.2271454 -0.556436 0.0628087 0.1524061 -0.0786775 -0.1074993 0.629987 0.1064843 -0.0278583 -0.0977428 0.1136961 -0.0237986 -0.0981261 -0.101745 0.2318416 -0.0190777 -0.0148587 0.026554 -0.0016714 0.1342423 0.0269365 0.0415482 0.060053 0.0212939 0.550008 -0.1489467 -0.1073895 -0.1048556 1.5055017 0.0644391 -0.1286391 0.0237397 -0.0667078 0.0861275 -0.1784951 -0.0452169 -0.4317161 0.0377872 0.0588503 -0.0739751 0.0360448 -0.1760543 -0.1221452 0.1387391 -0.0492545 0.3375429 0.1580213 -0.079782 -0.0148324 -0.0309953 -0.1823098 -0.0505612 0.0322914 -0.0015672 0.0344582 0.0925184 -0.0198386 -0.073248 -0.0279224 0.060061 0.4847552 0.0033728 -0.049955 0.2821107 -0.0046705 -0.0568174 -0.0564862 -0.0022494 0.2523129 -0.0205616 -0.0362309 0.0356618 -0.0808338 -0.0439236 0.1453988 0.0283734 0.0865176 -0.0110289 0.0704465 0.0015387 -0.0256116 0.1032825 0.0193145 -0.1119521 -0.0141774 -0.0296704 0.037549 0.0294286 0.056418 0.0024882 0.0353535 -0.1042104 -0.1344387 -0.0038599 -0.0847176 -0.0025195 0.0395606 -0.050948 0.0611154 -0.0262359 -0.0051226 0.0977819 0.0579889 0.0522484 0.003284 0.0824327 -0.0605686 0.0349304 -0.0355652 0.0275073 0.005304 0.0366232 0.0076784 0.2038031 0.0526953 0.0601655 0.0370504 0.0375233 0.0474369 -0.008568 0.0399717 -0.0133171 0.2131265 0.0176527 -0.038057 0.0524078 -0.097371 -0.054705 0.1199286 0.1085106 0.1087276 -0.0005893 -0.061503 0.0128532 -0.1078824 0.0241706 0.1003622 0.0160721 -0.147887 0.0209929 -0.0817287 0.075865 -0.0163253 0.0012168 0.0394987 -0.0895424 -0.1118664 0.0464727 -0.1125968 0.0263147 -0.0146198 -0.0102902 0.0543659 0.0204674 0.0977868 -0.0852469 0.1260839 -0.0507436 -0.1030516 0.2012475 0.0550786 -0.0134353 -0.1111229 -0.0001906 0.0228059 -0.0161163 -0.012306 0.1264521 -0.1034082 0.0127509 -0.0606779 0.0591347 0.0964158 0.0679441 -0.1261907 0.0504441 -0.0147654 unknown
polarizability: 123.1508737|-3.7960225|121.1107668|-7.1178691|0.607426|63.6376705 unknown
InChI: InChI=1S/C7H12N2S/c1-3-4-9-6-5-8(2)7(9)10/h5-6H,3-4H2,1-2H3
charge 0 multiplicity 1
22 atoms
S  -0.48853 -2.242288 -0.18452
N  0.235005 0.461049 -0.368231
N  -1.906093 0.16711 0.134993
C  1.649912 0.173783 -0.654511
C  2.502941 0.053388 0.628448
C  -0.721722 -0.538277 -0.137945
C  -0.341862 1.73545 -0.228544
C  -1.674033 1.553531 0.079864
C  3.973506 -0.274412 0.296544
C  -3.18605 -0.479922 0.428651
H  2.041216 0.971897 -1.313148
H  1.67699 -0.78509 -1.20448
H  2.441954 0.997588 1.204475
H  2.067867 -0.745013 1.257807
H  0.228966 2.649139 -0.362331
H  -2.458868 2.281897 0.258653
H  4.433769 0.514121 -0.329103
H  4.575185 -0.366585 1.218113
H  4.050996 -1.23136 -0.252138
H  -3.542562 -0.204073 1.436722
H  -3.018057 -1.56976 0.387676
H  -3.946928 -0.200272 -0.321093
