program: Gaussian 09
title: 000160067
version: EM64L-G09RevD.01
frameworkgroup: C1[X(C11H13N5O4)]
method: RPBEPBE
basis: SDD
operation: Freq
keyword: #p
keyword: freq=noraman
keyword: PBEPBE/SDD
title: #p freq=noraman PBEPBE/SDD
converged: YES YES NO NO
title: Mulliken charges:
elementType: O O O O N N N N N C C C C C C C C C C C H H H H H H H H H H H H H
charge: -0.297821 -0.451183 -0.433557 -0.426337 -0.198043 -0.085020 -0.040273 -0.062583 -0.609670 0.283056 -0.192732 -0.125923 -0.248065 -0.147583 -0.457182 0.151706 -0.239607 -0.106008 0.167384 -0.362708 0.272677 0.314895 0.287656 0.256193 0.245939 0.221057 0.376471 0.366513 0.271852 0.345194 0.245310 0.334622 0.343769
chargesum: 0.00000
title: Mulliken charges with hydrogens summed into heavy atoms:
elementType: O O O O N N N N N C C C C C C C C C C C
charge: -0.297821 -0.074712 -0.067044 -0.081143 -0.198043 -0.085020 -0.040273 -0.062583 0.068722 0.283056 0.079945 0.188972 0.039591 0.108610 0.009814 0.151706 0.032246 -0.106008 0.167384 -0.117398
polarizability: 2.26672134e+02 4.21813078e+00 1.51164845e+02 -5.74261500e+00 2.06445103e+01 1.13040205e+02
1716.lowfreq: -6.5868 -0.0009 -0.0007 -0.0001 2.5645 5.4848 23.2071 28.2139 49.8390
frequency: 23.0473 28.0301 49.8238 67.1576 89.4859 122.9724 147.4508 187.5855 200.1303 227.4787 243.0150 261.2425 268.1932 293.7521 314.4929 322.6269 352.0702 401.8054 414.4649 472.3795 491.2486 509.2693 513.4245 544.2728 547.4083 559.0149 574.5481 597.9210 622.2268 647.7525 665.9929 669.1520 684.9495 701.9487 708.3432 788.0156 814.5789 820.5516 824.0646 834.5785 851.6160 899.0177 931.0578 939.4200 959.8323 964.6937 980.8126 1003.9124 1027.7803 1031.3131 1070.6486 1080.1021 1119.8332 1132.2410 1177.7893 1188.5970 1196.0716 1225.3955 1236.9968 1243.0312 1258.0609 1272.6185 1289.7045 1300.7630 1312.3976 1315.0717 1335.1201 1358.3184 1362.3604 1366.2464 1378.6947 1381.5474 1386.7304 1410.9795 1432.2180 1463.2070 1464.6173 1545.3959 1578.0083 1631.9531 2997.4004 3014.6020 3040.0124 3087.9278 3101.9017 3129.5274 3168.4078 3225.0146 3397.6393 3442.9087 3540.0381 3561.2468 3695.0961
redmass: 6.5915 6.6723 5.7461 5.7843 4.9599 5.7992 6.7583 4.5430 6.9763 5.6795 2.3522 4.2502 5.3833 5.9143 1.2516 5.9585 5.7118 5.8529 4.2581 1.2501 3.8076 8.6189 1.2195 1.1866 2.9993 4.1317 4.5205 7.9790 3.6999 4.7769 1.4570 8.3060 3.2168 5.2494 6.0359 2.5849 2.7280 3.5135 4.2432 5.1229 8.3258 3.3813 1.4327 2.7501 2.4795 2.4925 2.8876 2.6841 3.4874 3.2343 2.7568 2.8345 1.4081 3.5258 1.4830 1.6982 1.2985 2.1233 1.6253 1.5634 1.7073 2.1997 2.1388 4.8408 1.3416 4.8051 1.4951 2.2901 1.1848 1.3859 1.6386 1.9075 1.6924 2.7672 3.1087 1.0804 4.1795 7.8855 1.9142 2.6836 1.0645 1.0857 1.0849 1.1005 1.0882 1.0935 1.0922 1.0978 1.0641 1.0645 1.0443 1.0668 1.1056
irintensity: 0.4584 0.2992 1.4285 2.7079 0.5549 1.6962 6.3388 11.1329 0.4392 11.5373 28.1541 31.2593 2.5129 3.6443 168.4415 6.4163 4.9033 2.0520 16.4102 61.8639 8.6233 4.1321 266.4815 2.0196 15.3461 3.1844 18.3341 4.9219 26.0836 41.2901 84.6988 9.2384 88.4514 14.6625 6.1216 21.8554 5.8650 53.0205 22.7355 6.2295 6.4087 20.4709 11.8877 32.1334 8.2760 33.8181 21.0604 50.8929 11.2906 84.5103 15.8819 31.9266 18.7040 15.0250 61.5694 31.1403 28.8561 39.1632 6.3445 10.2863 46.3577 38.9864 21.0122 49.0268 6.5171 40.7227 2.3523 77.2718 10.1235 31.4013 16.3887 64.0476 12.7328 4.8819 68.7966 9.3545 26.3270 73.6390 40.4347 616.5972 35.6984 21.5877 14.5041 9.5633 7.9482 9.8091 16.0380 0.6044 71.0156 22.1747 129.3423 8.1646 49.6000
temp: 298.150 k
press: 1.00000 atm
elementType: 8 8 8 8 7 7 7 7 7 6 6 6 6 6 6 6 6 6 6 6 1 1 1 1 1 1 1 1 1 1 1 1 1
symmnumber: 1
zpe: 652636.9 jmol-1
zpe.correction: 0.248576 hartree
zpe.thermalcorrener: 0.266046 hartree
zpe.thermalcorrenthalpy: 0.266990 hartree
zpe.thermalcorrgfe: 0.202090 hartree
zpe.sumelectzpe: -1000.092636 hartree
zpe.sumelectthermal: -1000.075166 hartree
zpe.sumelectthermalent: -1000.074222 hartree
zpe.sumelectthermalfe: -1000.139122 hartree
dipole: -0.3493 4.0333 -1.6311
dipole: 4.3646
quadrupole: -113.5400 -115.8873 -122.8093
quadrupole: 6.6736 8.4550 0.2830
quadrupole: 3.8722 1.5249 -5.3971 6.6736 8.4550 0.2830
hfenergy: -1000.3412122 hartree
pointgroup: C01 [X(C11H13N5O4)]
dipole: -0.0966847 1.5528377 -0.7266411 debye
polarizability: 226.8123162|1.9447862|153.1304204|-5.637762|18.6111487|110.9344487 unknown
InChI: InChI=1S/C11H13N5O4/c12-9-4-10(14-2-13-9)16(3-15-4)5-6(18)7(19)11(1-17)8(5)20-11/h2-3,5-8,17-19H,1,12H2
charge 0 multiplicity 1
33 atoms
O  -2.69836 -0.680314 -1.624848
O  -3.846871 -1.634287 0.657601
O  -1.56656 -1.810059 2.040204
O  -3.888359 2.606309 -0.057428
N  0.522763 0.14263 0.238113
N  2.087863 1.715108 0.843082
N  2.032878 -1.586548 -0.707086
N  4.398064 -0.921393 -0.570355
N  5.108282 1.13558 0.349518
C  -3.027699 0.367988 -0.558466
C  -1.61259 0.203321 -1.044142
C  -0.764219 -0.524522 0.008056
C  -3.154758 -0.341291 0.796503
C  -1.681375 -0.583097 1.289715
C  -3.990002 1.458492 -0.975011
C  1.77109 -0.388213 -0.114446
C  0.778557 1.405418 0.803492
C  2.720788 0.594618 0.271397
C  4.090671 0.281438 0.021949
C  3.374349 -1.770347 -0.89656
H  -1.133816 0.865922 -1.774112
H  -0.520962 -1.547208 -0.334537
H  -3.738529 0.246321 1.519249
H  -1.388053 0.236909 1.971614
H  -5.030566 1.109176 -0.871127
H  -3.811898 1.742158 -2.031184
H  -3.639382 -1.965781 -0.261926
H  -2.362695 -2.362877 1.788841
H  -0.013977 2.049722 1.178258
H  -3.071067 3.125678 -0.26713
H  3.6715 -2.712202 -1.366802
H  6.067436 0.856667 0.15336
H  4.901698 2.025783 0.797309
