program: Gaussian 09
title: 000159972
version: EM64L-G09RevD.01
frameworkgroup: C1[X(C19H29BrO3)]
method: RPBEPBE
basis: SDD
operation: Freq
keyword: #p
keyword: freq=noraman
keyword: PBEPBE/SDD
title: #p freq=noraman PBEPBE/SDD
converged: YES YES NO NO
title: Mulliken charges:
elementType: Br O O O C C C C C C C C C C C C C C C C C C C H H H H H H H H H H H H H H H H H H H H H H H H H H H H H
charge: -0.000063 -0.453903 -0.217798 -0.210100 0.392680 -0.191673 -0.144734 -0.093531 0.370875 0.216104 -0.537727 -0.535351 -0.546700 -0.434416 -0.487179 -0.021248 -0.636592 -0.792702 -0.518549 -0.836728 -0.816790 -0.544631 0.183978 0.217264 0.252117 0.191838 0.218133 0.200656 0.231710 0.210350 0.224388 0.223595 0.235888 0.250453 0.247244 0.215771 0.253830 0.318956 0.243566 0.221912 0.208783 0.220348 0.240179 0.227783 0.225725 0.250552 0.224827 0.213549 0.246230 0.255882 0.260473 0.324775
chargesum: 0.00000
title: Mulliken charges with hydrogens summed into heavy atoms:
elementType: Br O O O C C C C C C C C C C C C C C C C C C C
charge: -0.000063 -0.129128 -0.217798 -0.210100 0.392680 0.025591 0.107384 0.098307 0.370875 0.216104 -0.118938 -0.093291 -0.098717 0.051925 -0.024163 0.232582 -0.317636 -0.118442 -0.058021 -0.132668 -0.132184 -0.028276 0.183978
polarizability: 2.72393337e+02 2.97027535e+00 2.26630417e+02 -1.72042906e+00 -1.34012290e+00 1.67203677e+02
1716.lowfreq: -8.3216 0.0007 0.0008 0.0009 2.3429 7.7730 32.8579 44.7741 62.8231
frequency: 32.6930 44.6885 62.8093 75.3635 91.5318 94.7823 122.8793 136.3121 143.3401 174.6047 187.5534 206.1959 209.6294 228.6799 233.6522 246.4103 267.8074 280.0708 282.9263 293.0409 306.6509 315.8545 328.1546 361.0028 372.7206 377.2374 386.0383 407.3761 420.4743 436.3912 464.6098 486.3529 495.0644 500.2630 525.3628 535.3963 555.9549 568.1741 572.3520 619.6241 681.2015 700.9323 711.9319 751.6218 773.5311 789.1091 814.9564 828.0360 838.1074 849.4580 887.2962 896.3986 902.8539 920.4946 932.0545 944.2381 963.9615 977.6866 983.0003 993.7288 997.4109 1009.0621 1025.2900 1027.1958 1040.4250 1054.3474 1069.9769 1078.0073 1083.7297 1091.7134 1115.6431 1117.7329 1129.5523 1139.5145 1142.6947 1150.7575 1156.4016 1165.7765 1177.3992 1190.5839 1202.1395 1215.2797 1219.9329 1228.5989 1232.3962 1247.0968 1250.8665 1268.8253 1276.3722 1278.9807 1285.5167 1286.7363 1300.4222 1309.9832 1313.7996 1321.6526 1326.4687 1327.5234 1330.7496 1334.6766 1344.5534 1355.8811 1360.1986 1362.4605 1388.1357 1397.5468 1402.5569 1442.4704 1455.3317 1463.8060 1467.1684 1468.4482 1469.8584 1470.9510 1473.5722 1477.6913 1482.7808 1489.7893 1491.8873 1496.6504 1660.7121 2903.1689 2923.2026 2958.5809 2971.8315 2973.5326 2976.2963 2979.8002 2989.3708 2990.2807 2992.9542 2994.4889 3000.2692 3001.0528 3015.9721 3016.9901 3043.8899 3048.9448 3050.8289 3060.5940 3060.8512 3065.7082 3081.3061 3081.8072 3082.6008 3086.0497 3086.8816 3088.2486 3097.9147 3540.3454
redmass: 4.8507 4.5013 3.8240 2.4297 7.0640 5.1523 5.8557 2.4419 1.9288 2.3955 3.0150 1.8546 1.7912 3.1068 1.9332 2.6489 1.2984 2.6447 1.6400 1.3442 2.9004 2.9161 2.3941 2.9955 2.4111 3.8429 3.1143 3.3071 3.8215 3.1029 3.1736 3.5247 3.2388 2.6522 2.8230 3.1580 3.4407 4.2589 3.7882 4.1611 2.7447 3.4704 3.0131 3.9593 3.1657 1.5983 2.1494 1.9269 2.4063 2.2838 2.2462 2.0347 2.1066 1.8446 1.7195 2.0094 2.0418 2.5741 2.2380 2.7217 1.9277 2.1394 2.4363 1.8791 1.8786 2.3976 1.8031 2.1299 2.0584 2.0454 2.4068 2.3412 2.0406 1.6594 2.3914 2.9694 1.8040 1.7084 2.1288 1.6886 1.8153 1.6139 1.7252 1.6336 1.5284 1.4096 1.5050 1.5836 1.3940 1.3565 1.4541 1.3953 1.3102 1.3885 1.3977 1.8410 1.3767 1.3703 1.4922 1.3797 1.4097 1.3820 1.4725 1.4146 1.2159 1.1934 1.2022 1.0713 1.0721 1.0777 1.0714 1.0864 1.0651 1.0610 1.0734 1.0688 1.0575 1.0827 1.0580 1.0565 12.1390 1.0812 1.0800 1.0589 1.0387 1.0718 1.0782 1.0735 1.0672 1.0572 1.0605 1.0416 1.0642 1.0401 1.0971 1.0667 1.0987 1.0984 1.1006 1.0956 1.0968 1.0978 1.0960 1.1004 1.1016 1.0953 1.0979 1.0956 1.0981 1.0657
irintensity: 2.2978 2.0166 1.3451 2.4900 0.4017 0.4734 0.8951 1.1834 1.0294 4.2431 1.1425 0.3641 3.5029 1.4735 4.7306 1.7624 57.2744 17.3261 5.0965 45.5344 5.9199 7.1306 2.6657 3.3271 1.3657 3.6861 8.9808 0.6652 7.1316 1.3039 8.2772 0.4985 6.9355 2.2652 13.5529 6.9506 1.7677 4.4944 0.7675 2.8503 6.2871 29.0786 15.9010 9.4912 7.8316 4.8645 0.9831 2.6783 11.8803 2.8892 27.7062 8.9886 24.0792 0.8060 3.8701 0.5826 25.9030 77.8989 3.5716 12.6454 6.2516 16.3668 20.2736 67.3457 46.8680 1.2553 64.3234 57.0383 6.6867 12.1003 21.5815 15.4939 4.6274 31.1618 10.3272 140.8515 3.1492 0.8094 24.3023 0.6761 25.9780 9.7561 1.5155 6.1958 4.7742 5.5990 1.2161 8.4955 5.5215 33.4580 1.0714 11.6680 3.9581 0.2381 2.4234 15.3643 4.4908 1.1748 1.3190 0.9314 3.6092 5.2072 2.2571 4.6604 29.4929 13.6895 31.1149 17.6329 1.6103 14.1638 16.1682 8.9686 9.0391 1.5267 0.7260 2.9169 4.2864 10.1496 0.4475 14.7752 351.8988 12.1554 18.5688 36.0788 29.8102 1.4348 7.5170 36.0555 27.5706 21.9726 38.2418 17.8198 14.9552 28.6809 37.7507 24.1939 47.5805 29.9957 24.0053 28.9043 12.3341 13.7007 15.6538 35.9946 37.5740 18.3761 41.3377 22.3435 27.3324 4.0653
temp: 298.150 k
press: 1.00000 atm
elementType: 35 8 8 8 6 6 6 6 6 6 6 6 6 6 6 6 6 6 6 6 6 6 6 1 1 1 1 1 1 1 1 1 1 1 1 1 1 1 1 1 1 1 1 1 1 1 1 1 1 1 1 1
symmnumber: 1
zpe: 1170534.4 jmol-1
zpe.correction: 0.445833 hartree
zpe.thermalcorrener: 0.468745 hartree
zpe.thermalcorrenthalpy: 0.469689 hartree
zpe.thermalcorrgfe: 0.395007 hartree
zpe.sumelectzpe: -978.761292 hartree
zpe.sumelectthermal: -978.738380 hartree
zpe.sumelectthermalent: -978.737436 hartree
zpe.sumelectthermalfe: -978.812118 hartree
dipole: -6.4264 -3.6011 -1.5296
dipole: 7.5238
quadrupole: -199.6290 -144.3367 -145.0652
quadrupole: 1.6387 4.9269 1.6293
quadrupole: -36.6187 18.6736 17.9451 1.6387 4.9269 1.6293
hfenergy: -979.2071249 hartree
pointgroup: C01 [X(C19H29Br1O3)]
dipole: -2.252891 -1.8541113 -0.498795 debye
polarizability: 270.1002573|10.3174545|228.550314|-2.0536467|-5.0482007|167.5768597 unknown
InChI: InChI=1S/C19H29BrO3/c1-17-7-6-15(21)23-16(17)14(20)10-11-12(17)4-8-18(2)13(11)5-9-19(18,3)22/h11-14,16,22H,4-10H2,1-3H3
charge 0 multiplicity 1
52 atoms
Br 2.711991 3.553715 -0.351892
O  -5.3074 -0.807729 0.376587
O  3.870856 0.629638 0.075822
O  5.903997 -0.391125 -0.063297
C  -2.764609 -0.5557 0.212511
C  -1.934597 0.71549 -0.155873
C  -0.474841 0.656114 0.341352
C  0.215657 -0.606732 -0.269208
C  1.725769 -0.709562 0.15185
C  -4.19147 -0.140864 -0.339176
C  -2.081024 -1.784463 -0.436368
C  -0.596992 -1.903473 0.008825
C  -2.837709 1.893113 0.291021
C  0.296708 1.944713 -0.04962
C  -4.291078 1.379306 0.024504
C  2.426218 0.619956 -0.288399
C  1.783155 1.861085 0.324618
C  -2.880332 -0.764923 1.747936
C  2.453796 -1.814381 -0.668768
C  1.895711 -0.970588 1.673191
C  -4.386216 -0.385013 -1.851473
C  3.972667 -1.852529 -0.385389
C  4.667446 -0.507411 -0.151541
H  -1.876172 0.749557 -1.267907
H  -0.48014 0.579144 1.447755
H  0.206172 -0.453763 -1.375624
H  -2.107655 -1.692195 -1.540718
H  -2.615646 -2.721163 -0.175773
H  -0.550918 -2.153482 1.085201
H  -0.137255 -2.753519 -0.530272
H  -2.619456 2.823509 -0.262055
H  -2.685711 2.111639 1.36512
H  0.209656 2.107105 -1.14294
H  -0.153754 2.824652 0.441975
H  -4.936214 1.480857 0.913653
H  -4.777032 1.939185 -0.793987
H  2.36615 0.698449 -1.394296
H  1.955617 1.903651 1.411841
H  -3.405662 0.071183 2.238476
H  -3.468085 -1.674127 1.962637
H  -1.893652 -0.877898 2.228273
H  2.276356 -1.626426 -1.747015
H  2.027761 -2.808643 -0.443822
H  1.242058 -0.324114 2.283398
H  1.646431 -2.018828 1.91592
H  2.93265 -0.786189 2.003074
H  -3.617226 0.123201 -2.460589
H  -4.356893 -1.46305 -2.103258
H  -5.373426 0.006809 -2.154038
H  4.521472 -2.364366 -1.195652
H  4.178737 -2.439932 0.530523
H  -5.371363 -1.745788 0.060886
