program: Gaussian 09
title: 000159929
version: EM64L-G09RevD.01
frameworkgroup: C1[X(C15H12Cl2N6O)]
method: RPBEPBE
basis: SDD
operation: Freq
keyword: #p
keyword: freq=noraman
keyword: PBEPBE/SDD
title: #p freq=noraman PBEPBE/SDD
converged: YES YES NO NO
title: Mulliken charges:
elementType: Cl Cl O N N N N N N C C C C C C C C C C C C C C C H H H H H H H H H H H H
charge: -0.011488 0.004567 -0.268081 -0.190987 -0.083392 -0.117292 0.053595 -0.639606 -0.587187 0.423315 -0.636323 0.280486 -0.458392 0.572870 0.054142 -0.377374 -0.329640 0.129293 -0.456894 -0.369770 -0.057547 -0.192702 -0.054060 -0.123237 0.253149 0.285038 0.220498 0.280613 0.262538 0.273915 0.265395 0.263460 0.336737 0.334938 0.328784 0.330637
chargesum: 0.00000
title: Mulliken charges with hydrogens summed into heavy atoms:
elementType: Cl Cl O N N N N N N C C C C C C C C C C C C C C C
charge: -0.011488 0.004567 -0.268081 -0.190987 -0.083392 -0.117292 0.053595 0.032069 0.072234 0.423315 -0.098135 0.280486 -0.237894 0.572870 0.054142 -0.096761 -0.067102 0.129293 -0.182979 -0.104375 -0.057547 0.070758 -0.054060 -0.123237
polarizability: 3.15895118e+02 -3.34575111e+01 3.16657471e+02 5.64064691e+00 1.23063041e+01 1.41236906e+02
1716.lowfreq: -6.2162 -0.0014 0.0003 0.0019 2.9190 5.1248 14.8326 18.3063 21.6477
frequency: 14.5920 18.2669 21.6313 48.1890 65.8060 91.8235 123.2894 131.4169 163.6108 166.0363 179.9226 189.7779 206.3915 251.7724 262.3299 265.9506 311.0159 314.2288 334.1440 351.0296 376.7935 393.7213 411.3845 427.4554 438.4996 441.2894 445.3985 461.1893 497.7865 520.6989 523.2144 530.2221 532.5897 550.3112 567.9023 576.9354 599.1970 650.4096 672.9404 682.0081 694.9122 712.5371 721.7355 742.2830 786.6888 798.0798 830.2767 843.4199 848.7279 859.8317 870.4617 879.8907 901.6242 921.0614 962.3567 989.4394 1001.7545 1024.0371 1037.6658 1045.5278 1105.5120 1120.2194 1127.9813 1149.5841 1152.4151 1206.3387 1232.6359 1257.2917 1270.5592 1296.8030 1307.6139 1334.3889 1348.6572 1364.4349 1373.3606 1386.5115 1394.3438 1405.9076 1448.7154 1462.7939 1471.1194 1472.5776 1508.3860 1536.3546 1556.9439 1568.9569 1596.2628 1603.4265 1628.2826 1633.9789 2978.2973 3064.6773 3138.9295 3153.3119 3155.9747 3164.2243 3174.6975 3191.0370 3549.1638 3560.9337 3701.2070 3721.3058
redmass: 9.0951 11.4351 5.7881 6.0611 9.2280 8.1271 5.2803 5.5618 8.3202 6.8151 6.6156 16.5615 5.9477 9.3978 6.4333 5.8115 4.2051 6.8356 3.9913 7.1284 1.4578 3.6810 5.6923 3.5288 2.9920 4.5273 2.6463 1.2077 5.3581 5.8118 5.3097 1.3180 3.5032 1.3085 6.0441 2.0194 6.0555 6.6256 5.9979 5.8556 6.4703 4.5433 6.2173 4.1730 3.2321 3.8069 1.6311 3.9169 1.7030 1.9310 4.2721 1.8648 2.6842 2.6018 1.3741 1.3370 5.4010 3.4790 3.3994 2.4787 2.5270 2.1174 1.9653 1.4742 1.3943 2.3006 1.9054 1.5549 1.5764 2.3371 3.6251 3.1780 3.7347 2.0414 5.9160 3.4223 2.1420 6.0927 1.2308 2.2360 4.7022 3.4087 3.0881 5.5092 5.3312 7.5011 6.4371 1.5783 1.7409 3.5754 1.0629 1.0964 1.0921 1.0894 1.0898 1.0893 1.0968 1.0963 1.0457 1.0440 1.1036 1.1059
irintensity: 0.2065 0.8199 0.3639 0.5745 2.7372 0.8544 0.5260 1.0596 2.7745 8.5718 1.4416 0.5575 7.1130 2.5397 8.5777 0.7948 6.6526 2.7153 4.3157 4.6357 36.5140 3.3209 6.1074 5.3855 32.1117 18.3854 46.3000 255.2101 5.0258 3.8030 1.7544 17.6247 5.3005 14.5708 0.8951 160.8238 5.2708 10.7954 1.0233 5.8541 2.5943 0.7630 8.0863 17.3303 10.0052 39.9268 10.5017 6.1503 46.5391 23.6954 37.4641 45.9821 88.8142 25.3130 0.5516 0.3894 28.3553 52.8516 32.9613 13.4774 2.1634 42.0631 3.6526 3.7605 9.4623 10.3120 108.6834 2.9767 9.0178 110.1156 41.7858 164.3810 52.4806 24.0776 6.3378 76.3055 14.5792 16.7348 34.0882 93.6398 75.7052 81.7758 79.9483 363.3233 209.0162 13.1292 5.6677 769.4269 249.2217 25.7833 23.7146 15.1922 2.0462 1.1535 5.4568 2.3701 0.7568 1.7993 79.5040 201.9590 41.9861 46.2208
temp: 298.150 k
press: 1.00000 atm
elementType: 17 17 8 7 7 7 7 7 7 6 6 6 6 6 6 6 6 6 6 6 6 6 6 6 1 1 1 1 1 1 1 1 1 1 1 1
symmnumber: 1
zpe: 670863.4 jmol-1
zpe.correction: 0.255518 hartree
zpe.thermalcorrener: 0.276752 hartree
zpe.thermalcorrenthalpy: 0.277696 hartree
zpe.thermalcorrgfe: 0.202713 hartree
zpe.sumelectzpe: -1900.939036 hartree
zpe.sumelectthermal: -1900.917803 hartree
zpe.sumelectthermalent: -1900.916859 hartree
zpe.sumelectthermalfe: -1900.991842 hartree
dipole: 1.0495 -3.1914 -1.2387
dipole: 3.5806
quadrupole: -151.2210 -161.3139 -149.2683
quadrupole: -10.6322 0.3680 0.1451
quadrupole: 2.7134 -7.3795 4.6661 -10.6322 0.3680 0.1451
hfenergy: -1901.1945546 hartree
pointgroup: C01 [X(C15H12Cl2N6O1)]
dipole: -0.7602527 0.9513332 -0.7081668 debye
polarizability: 333.7065593|-29.5844155|284.4195961|-0.0834513|-46.7906962|155.6633399 unknown
InChI: InChI=1S/C15H12Cl2N6O/c16-11-3-1-8(5-12(11)17)7-23(22-24)9-2-4-13-10(6-9)14(18)21-15(19)20-13/h1-6H,7,18-19H2
charge 0 multiplicity 1
36 atoms
Cl 3.244318 3.26239 -2.309243
Cl 4.73091 3.53852 0.619864
O  2.537011 -3.767767 0.616911
N  0.962009 -2.249649 0.031261
N  -4.368407 -0.427427 0.714259
N  -3.802344 1.702679 -0.374877
N  1.338712 -3.348707 0.823805
N  -1.665846 2.223089 -1.110636
N  -5.971563 1.236615 0.348238
C  -0.372004 -1.76033 0.210735
C  1.895407 -1.699615 -0.984856
C  -2.059299 -0.00452 -0.095329
C  -0.732248 -0.486244 -0.26066
C  2.579942 -0.400817 -0.578888
C  -3.055927 -0.827727 0.550332
C  -1.349801 -2.577885 0.871978
C  -2.653228 -2.117501 1.031067
C  -2.51703 1.311733 -0.527496
C  2.604821 0.692906 -1.476508
C  3.227157 -0.27666 0.676313
C  3.256446 1.892143 -1.121815
C  3.877355 0.92298 1.028647
C  -4.670643 0.80647 0.22882
C  3.892826 2.012375 0.130767
H  1.343363 -1.576014 -1.932385
H  2.658313 -2.493879 -1.11578
H  0.026003 0.14092 -0.737559
H  -1.057824 -3.565101 1.23623
H  -3.41435 -2.73373 1.518286
H  2.131454 0.61705 -2.461999
H  3.227672 -1.116916 1.3779
H  4.378538 1.022685 1.995852
H  -2.055821 3.125496 -1.377152
H  -0.665466 2.069316 -1.192076
H  -6.224337 2.158704 0.004786
H  -6.65232 0.625014 0.790208
