program: Gaussian 09
title: 000159854
version: EM64L-G09RevD.01
frameworkgroup: C1[X(C12H14N2O2)]
method: RPBEPBE
basis: SDD
operation: Freq
keyword: #p
keyword: freq=noraman
keyword: PBEPBE/SDD
title: #p freq=noraman PBEPBE/SDD
converged: YES YES NO NO
title: Mulliken charges:
elementType: O O N N C C C C C C C C C C C C H H H H H H H H H H H H H H
charge: -0.227155 -0.227132 -0.129091 -0.129107 -0.382367 -0.417590 -0.382362 -0.417586 0.137062 0.136968 0.254317 0.254350 -0.144018 -0.144105 -0.815040 -0.815044 0.263510 0.245186 0.245317 0.244146 0.245182 0.263511 0.244136 0.245318 0.228733 0.220696 0.276366 0.228743 0.220693 0.276363
chargesum: 0.00000
title: Mulliken charges with hydrogens summed into heavy atoms:
elementType: O O N N C C C C C C C C C C C C
charge: -0.227155 -0.227132 -0.129091 -0.129107 0.126329 0.071873 0.126331 0.071868 0.137062 0.136968 0.254317 0.254350 -0.144018 -0.144105 -0.089248 -0.089242
polarizability: 2.45768117e+02 2.69425673e+01 1.69366896e+02 -6.00720979e+00 -3.48174738e+00 8.32330423e+01
1716.lowfreq: -5.4171 -0.0008 -0.0006 -0.0004 7.8588 11.3257 44.1329 83.2287 87.3792
frequency: 44.1329 83.2287 87.3775 115.2902 118.2782 128.4027 131.3997 146.8062 161.1430 179.3541 191.4960 242.9870 285.5816 287.1450 319.3030 329.1752 387.1824 393.1618 413.2490 424.4755 479.9017 503.2383 516.9503 575.0699 723.8433 737.4185 763.2597 784.7602 789.0399 799.7349 817.1831 871.1379 921.4153 927.1310 958.7531 986.8139 999.8481 1016.4116 1037.1887 1037.7088 1057.5366 1076.0068 1086.2886 1100.9373 1104.4381 1106.1288 1110.7239 1119.8223 1130.1823 1135.1998 1142.3393 1187.3596 1331.3673 1345.6966 1387.7713 1389.5077 1421.5508 1422.3023 1460.1479 1460.6118 1463.9462 1465.8045 1478.5113 1479.5014 1482.7554 1483.2058 1510.2816 1526.2614 1586.9373 1612.6720 2975.4184 2975.7127 3048.0858 3048.0991 3074.6757 3074.8070 3093.8365 3093.9226 3101.7681 3101.9268 3180.5321 3180.5433 3201.9079 3201.9415
redmass: 4.7868 3.9408 4.4033 1.5017 1.7234 1.2611 1.5451 3.3875 3.3445 3.8020 3.6907 4.3589 2.8342 5.0750 4.1547 3.3610 7.4847 6.7519 4.9389 6.1656 9.0594 8.3261 5.9492 5.0519 4.2507 10.1007 4.9587 1.1679 1.0344 3.4002 6.1226 4.5088 5.6545 2.8040 2.4444 1.1236 1.3179 2.1597 1.4535 1.5015 2.0452 1.7582 1.8100 1.3488 1.3518 1.3384 1.3346 1.6567 1.8031 1.4862 2.1237 4.5009 5.7030 4.2670 1.2889 1.3030 4.7947 4.4479 1.0743 1.0885 1.0932 1.0945 1.3270 1.2450 1.1510 1.1278 5.9417 7.0990 9.3322 9.3023 1.0380 1.0380 1.0969 1.0969 1.0518 1.0518 1.0570 1.0570 1.0971 1.0970 1.1185 1.1185 1.1175 1.1175
irintensity: 8.9747 4.4147 0.0000 3.7397 0.0005 0.0000 2.0464 4.1873 10.6580 0.0000 0.0000 37.6834 9.2798 0.0001 0.0000 0.0000 13.9301 0.0000 15.8162 0.0000 0.0000 0.0000 10.7462 27.1775 0.0000 4.8213 9.8776 0.0003 57.4013 0.0000 0.0000 6.5432 0.0000 21.7975 73.6318 0.0000 19.2060 0.0000 1.3190 0.0000 0.0000 35.0759 0.0000 6.0735 0.0000 7.5520 0.0000 123.6719 0.0000 0.2969 0.0000 35.8203 186.8928 0.0000 49.9106 0.0001 0.1058 423.8085 25.5915 0.0003 7.8442 0.0000 0.0014 115.0271 78.6971 0.0049 0.0000 435.7246 369.2172 0.0001 56.7759 0.0020 12.6931 28.2052 57.8978 0.0284 0.0353 49.5331 5.3523 0.0224 5.4633 4.7171 40.0585 0.0076
temp: 298.150 k
press: 1.00000 atm
elementType: 8 8 7 7 6 6 6 6 6 6 6 6 6 6 6 6 1 1 1 1 1 1 1 1 1 1 1 1 1 1
symmnumber: 1
zpe: 620472.8 jmol-1
zpe.correction: 0.236326 hartree
zpe.thermalcorrener: 0.252336 hartree
zpe.thermalcorrenthalpy: 0.253281 hartree
zpe.thermalcorrgfe: 0.193307 hartree
zpe.sumelectzpe: -724.337162 hartree
zpe.sumelectthermal: -724.321151 hartree
zpe.sumelectthermalent: -724.320207 hartree
zpe.sumelectthermalfe: -724.380181 hartree
dipole: 0.0000 -0.0002 0.0004
dipole: 0.0005
quadrupole: -67.5004 -104.6831 -93.6695
quadrupole: -9.9909 5.3447 1.7247
quadrupole: 21.1172 -16.0654 -5.0518 -9.9909 5.3447 1.7247
hfenergy: -724.5734879 hartree
pointgroup: C01 [X(C12H14N2O2)]
dipole: -0.0000096 0.0000825 -0.0001575 debye
polarizability: 246.6270736|-25.6545946|168.3996087|-5.9198592|4.8755603|83.3413728 unknown
InChI: InChI=1S/C12H14N2O2/c1-7-9(13-3-4-13)12(16)8(2)10(11(7)15)14-5-6-14/h3-6H2,1-2H3
charge 0 multiplicity 1
30 atoms
O  1.400249 -2.355367 -0.084204
O  -1.40027 2.355249 0.084196
N  2.805987 -0.000396 0.213444
N  -2.805936 0.000355 -0.21364
C  3.815544 -0.873251 -0.404783
C  3.918789 0.658249 -0.513447
C  -3.815645 0.873326 0.404205
C  -3.919021 -0.658148 0.512976
C  1.433285 0.064416 0.072006
C  -1.433286 -0.064535 -0.071662
C  0.745222 1.275563 0.116486
C  -0.745222 -1.27569 -0.116049
C  0.712576 -1.272712 -0.040403
C  -0.712606 1.272545 0.041357
C  1.4486 2.602737 0.304259
C  -1.448535 -2.602821 -0.304381
H  3.520214 -1.443806 -1.290657
H  4.467036 -1.410404 0.291548
H  4.644918 1.201072 0.100285
H  3.689237 1.112375 -1.485122
H  -4.466889 1.41045 -0.292383
H  -3.520569 1.443942 1.290124
H  -3.689816 -1.112152 1.48479
H  -4.644989 -1.200997 -0.10092
H  2.131951 2.566895 1.173387
H  -2.053654 -2.890473 0.576428
H  0.698089 3.392202 0.467444
H  -2.131266 -2.566895 -1.173997
H  2.053059 2.890387 -0.577005
H  -0.697955 -3.392316 -0.467082
