program: Gaussian 09
title: 000159844
version: EM64L-G09RevD.01
frameworkgroup: C1[X(CH3NO2)]
method: RPBEPBE
basis: SDD
operation: Freq
keyword: #pfreq=noraman
keyword: PBEPBE/SDD
title: #p freq=noraman PBEPBE/SDD
converged: NO NO NO NO
title: Mulliken charges:
elementType: O O N C H H H
charge: -0.393349 -0.288728 0.190878 -0.401213 0.257767 0.261876 0.372769
chargesum: 0.00000
title: Mulliken charges with hydrogens summed into heavy atoms:
elementType: O O N C
charge: -0.020580 -0.288728 0.190878 0.118430
polarizability: 4.15976547e+01 -5.18741542e+00 3.56609119e+01 1.96496359e-03 -3.49863041e-04 1.03330550e+01
1716.lowfreq: -6.1853 -0.0012 -0.0010 -0.0007 20.0228 28.8151 298.0450 440.7601 496.4807
frequency: 298.0382 440.7601 496.4798 585.3904 641.7997 702.2249 771.6476 1038.1220 1221.6835 1234.9141 1418.1675 1653.5580 3168.4475 3317.8658 3468.0714
redmass: 1.1154 3.2404 4.7345 3.6136 1.1925 5.3719 1.3385 2.5976 1.9680 1.4622 1.1750 5.5198 1.0521 1.1250 1.0662
irintensity: 166.0103 3.8396 4.5021 3.9278 5.5641 151.0971 150.3717 39.3854 45.1242 131.5952 17.8502 157.0142 9.1417 0.9470 42.6228
temp: 298.150 k
press: 1.00000 atm
elementType: 8 8 7 6 1 1 1
symmnumber: 1
zpe: 122361.1 jmol-1
zpe.correction: 0.046605 hartree
zpe.thermalcorrener: 0.050935 hartree
zpe.thermalcorrenthalpy: 0.051879 hartree
zpe.thermalcorrgfe: 0.020268 hartree
zpe.sumelectzpe: -244.667301 hartree
zpe.sumelectthermal: -244.662970 hartree
zpe.sumelectthermalent: -244.662026 hartree
zpe.sumelectthermalfe: -244.693638 hartree
dipole: 0.5887 -1.1842 0.0002
dipole: 1.3225
quadrupole: -16.5090 -27.5415 -24.6657
quadrupole: -0.6054 0.0003 -0.0001
quadrupole: 6.3964 -4.6361 -1.7603 -0.6054 0.0003 -0.0001
hfenergy: -244.7139055 hartree
pointgroup: C01 [X(C1H3N1O2)]
dipole: -0.0496993 0.5179218 -0.0000608 debye
dipolederiv: -1.1463678 0.10069 0.0000406 0.051735 -0.1573375 0.0000073 0.000028 0.000007 -0.4156124 -0.5032744 0.1353029 0.0000042 0.0826993 -1.1009235 0.0000376 0.000011 0.0000044 -0.2617641 1.4065018 -0.0484436 -0.0000641 -0.0241615 1.3996367 -0.0000579 -0.000047 -0.000027 0.1793551 -0.1787436 -0.3011092 -0.0000068 -0.2078964 -0.388916 0.0000072 -0.0000131 0.0000151 -0.4360334 0.060105 0.0364258 0.0000127 0.0317109 0.0768618 0.0000069 0.0000125 0.0000036 0.2698789 0.0435412 0.0300637 0.0000115 0.0278148 0.0791685 0.0000069 0.0000114 0.0000062 0.2557992 0.3182379 0.0470704 0.0000017 0.038098 0.0915099 -0.000008 -0.0000028 -0.0000093 0.4083767 unknown
polarizability: 35.2832427|4.9522237|41.975324|-0.001483|-0.0013357|10.333055 unknown
InChI: InChI=1S/CH3NO2/c1-2(3)4/h3H,1H2
charge 0 multiplicity 1
7 atoms
O  -1.353893 0.234724 0.000093
O  0.455153 -1.305467 0.000047
N  0.126528 -0.058423 0.000035
C  0.856863 1.046098 -0.000065
H  0.343472 2.004051 -0.000072
H  1.9390 0.931485 -0.000128
H  -1.733024 -0.692269 0.000089
