program: Gaussian 09
title: 000159647
version: EM64L-G09RevD.01
frameworkgroup: C1[X(C15H12ClN)]
method: RPBEPBE
basis: SDD
operation: Freq
keyword: #p
keyword: freq=noraman
keyword: PBEPBE/SDD
title: #p freq=noraman PBEPBE/SDD
converged: YES YES NO NO
title: Mulliken charges:
elementType: Cl N C C C C C C C C C C C C C C C H H H H H H H H H H H H
charge: -0.065836 0.000876 -0.690366 0.195886 0.303479 0.097617 0.192925 0.290830 -0.402129 -0.402910 -0.816286 -0.102409 -0.223916 -0.300880 -0.484705 -0.199672 -0.357081 0.237821 0.256066 0.269186 0.247118 0.231933 0.239227 0.258348 0.254453 0.232094 0.264137 0.229658 0.244537
chargesum: 0.00000
title: Mulliken charges with hydrogens summed into heavy atoms:
elementType: Cl N C C C C C C C C C C C C C C C
charge: -0.065836 0.000876 -0.196479 0.195886 0.303479 0.097617 0.192925 0.290830 -0.132944 -0.155792 -0.086778 -0.102409 0.030537 -0.068787 -0.220568 0.029986 -0.112545
polarizability: 3.38315043e+02 1.69535233e+01 1.72930705e+02 -1.54385225e+00 5.60640216e+00 8.12182773e+01
1716.lowfreq: -0.0012 0.0003 0.0019 1.9533 3.4065 7.9211 39.5687 50.4345 85.1103
frequency: 39.5623 50.4315 85.1093 99.6164 154.1144 171.5349 205.3716 231.6393 248.3308 251.3691 288.6151 304.7953 372.8192 397.9819 401.3575 424.7104 469.9170 519.9196 542.5112 576.2400 602.9290 607.1816 617.8867 679.7641 717.9603 721.5739 732.3911 795.4871 813.0411 823.2129 869.2736 871.5742 917.9884 931.9316 942.8636 950.9742 967.3171 983.3008 1004.1330 1036.4398 1040.1554 1056.0723 1069.0746 1079.6002 1118.7692 1128.6408 1139.4331 1185.6801 1202.3981 1210.0945 1257.1949 1291.0911 1304.5034 1330.4298 1359.0574 1387.0061 1399.4085 1406.4116 1415.2838 1421.6232 1456.3103 1461.3321 1471.7664 1481.9743 1535.7155 1576.4431 1582.8962 1603.0386 1609.3449 2972.1574 2977.7239 3024.2918 3046.9548 3091.2820 3131.5301 3140.9189 3141.0855 3146.8397 3156.6438 3166.0604 3171.6970
redmass: 5.4677 4.1929 5.7116 4.9536 2.3965 2.2556 2.7958 3.1654 4.2206 3.5782 2.4742 4.6162 4.4379 6.6366 3.2691 2.9420 3.7063 3.4989 3.8099 5.7836 3.4611 6.4686 5.1068 6.8639 3.2739 2.4482 3.5980 3.8745 1.7463 1.4334 1.4529 4.6262 1.3331 1.6603 1.6879 1.4629 3.2289 1.4008 3.6816 1.8918 1.7805 2.6272 2.9929 2.1888 1.3686 1.5335 1.4855 1.9399 1.6346 1.4487 1.6486 2.3977 8.5733 1.7483 2.0114 5.0516 1.3045 2.2166 1.5135 2.1443 2.1195 2.1968 1.2005 1.1663 4.7155 6.5904 6.8207 7.7714 7.4231 1.0395 1.0613 1.0977 1.0954 1.0976 1.0862 1.0896 1.0917 1.0912 1.0932 1.1003 1.0959
irintensity: 2.4152 0.2942 0.7260 0.1456 0.3900 0.2420 0.6580 2.6677 4.4000 4.0626 1.5962 3.7540 2.3541 14.7151 2.5845 6.8172 0.0301 1.1236 3.7931 0.2390 4.0227 7.1455 5.0220 0.5247 23.2734 20.9182 0.0578 2.6008 23.7151 53.0856 15.8985 37.4755 2.2448 7.2957 1.7128 1.0552 5.3107 0.5264 5.9233 3.0145 2.5857 4.4712 30.2556 5.2258 1.6569 6.1406 5.6668 36.9420 1.9565 5.4891 0.8201 2.0889 3.0939 6.2757 3.9636 13.7598 23.6882 10.0472 21.8656 34.1813 38.3995 5.6683 28.8357 15.3262 4.1000 4.3591 41.2675 12.6020 4.5999 21.1222 10.9289 6.9082 19.1129 14.6522 0.4054 5.8749 26.7146 17.1221 1.8355 27.8899 6.5479
temp: 298.150 k
press: 1.00000 atm
elementType: 17 7 6 6 6 6 6 6 6 6 6 6 6 6 6 6 6 1 1 1 1 1 1 1 1 1 1 1 1
symmnumber: 1
zpe: 587193.6 jmol-1
zpe.correction: 0.223650 hartree
zpe.thermalcorrener: 0.237816 hartree
zpe.thermalcorrenthalpy: 0.238760 hartree
zpe.thermalcorrgfe: 0.181823 hartree
zpe.sumelectzpe: -1092.435356 hartree
zpe.sumelectthermal: -1092.421190 hartree
zpe.sumelectthermalent: -1092.420246 hartree
zpe.sumelectthermalfe: -1092.477183 hartree
dipole: -0.6383 -0.9480 -1.0471
dipole: 1.5500
quadrupole: -124.1225 -93.2448 -110.1543
quadrupole: 14.3545 4.5641 0.3786
quadrupole: -14.9486 15.9291 -0.9804 14.3545 4.5641 0.3786
hfenergy: -1092.659006 hartree
pointgroup: C01 [X(C15H12Cl1N1)]
dipole: -0.2649401 -0.3649664 -0.4104674 debye
polarizability: 339.5395133|9.1305816|171.8156802|0.7031372|4.8427525|81.1088319 unknown
InChI: InChI=1S/C15H12ClN/c1-10-14-5-4-13(16)7-12(14)8-15(10)11-3-2-6-17-9-11/h2-7,9H,8H2,1H3
charge 0 multiplicity 1
29 atoms
Cl 5.666442 -1.251841 0.208747
N  -4.369049 0.76553 0.560926
C  0.226211 -1.270484 0.105158
C  -0.687397 -0.045175 -0.012237
C  1.619616 -0.676613 0.077685
C  0.079516 1.107571 -0.13505
C  1.507187 0.738604 -0.071967
C  -2.151675 -0.179435 0.011594
C  2.872684 -1.30269 0.164212
C  2.668411 1.54287 -0.139812
C  -0.368893 2.531386 -0.353517
C  4.016352 -0.474771 0.096981
C  3.938701 0.926098 -0.05242
C  -2.796253 -1.368988 -0.440905
C  -3.009705 0.842235 0.527512
C  -4.200933 -1.469128 -0.404318
C  -4.951914 -0.375906 0.086411
H  0.077649 -1.978702 -0.735076
H  0.026933 -1.84021 1.034038
H  2.975343 -2.386106 0.277547
H  2.602105 2.630127 -0.253244
H  0.31307 3.046659 -1.054955
H  -0.357528 3.111923 0.590053
H  -1.388296 2.586726 -0.769033
H  4.85532 1.521104 -0.09868
H  -2.200887 -2.201173 -0.83221
H  -2.583549 1.74909 0.968467
H  -4.710076 -2.372476 -0.755072
H  -6.046783 -0.404723 0.115765
