program: Gaussian 09
title: 000159631
version: EM64L-G09RevD.01
frameworkgroup: C1[X(C10H12O)]
method: RPBEPBE
basis: SDD
operation: Freq
keyword: #pfreq=noraman
keyword: PBEPBE/SDD
title: #p freq=noraman PBEPBE/SDD
converged: YES YES NO NO
title: Mulliken charges:
elementType: O C C C C C C C C C C H H H H H H H H H H H H
charge: -0.305427 -0.217569 -0.360976 0.492176 -0.612566 -0.389272 0.334706 0.324841 -0.412621 -0.813998 -0.808664 0.232617 0.223710 0.228962 0.233134 0.259462 0.229865 0.229049 0.226561 0.225479 0.224741 0.226230 0.229559
chargesum: 0.00000
title: Mulliken charges with hydrogens summed into heavy atoms:
elementType: O C C C C C C C C C C
charge: -0.305427 0.015049 0.091696 0.492176 -0.379432 -0.129810 0.334706 0.324841 -0.182756 -0.132908 -0.128134
polarizability: 1.53926078e+02 -5.60170917e-01 1.09141662e+02 2.82318119e+00 -1.14091508e+00 6.48053453e+01
1716.lowfreq: -4.6733 0.0005 0.0010 0.0010 2.9885 15.9142 45.1058 102.0677 118.9660
frequency: 45.0947 102.0606 118.9623 156.0211 162.2111 190.0819 256.5496 285.1821 317.4754 394.9785 413.0624 446.3922 519.1635 570.2114 588.5794 700.0745 722.2006 728.8383 746.6777 807.4032 840.2326 885.8929 908.7457 961.6046 970.6151 992.1642 1006.2084 1019.1441 1029.7062 1053.2290 1095.5626 1104.8890 1125.6064 1169.5024 1204.6404 1227.0657 1258.8667 1295.0751 1341.3942 1380.1391 1392.2314 1405.6250 1423.3049 1461.9144 1468.6053 1473.4545 1475.9813 1478.4528 1505.1090 1586.0955 1627.1321 2967.8110 2969.0938 3038.6312 3042.7897 3055.7862 3081.4564 3084.3133 3085.5817 3106.8461 3120.8885 3151.5677 3165.9444
redmass: 3.9273 2.8935 1.0683 4.2000 1.1308 2.6563 2.9510 2.6972 4.4157 3.5166 3.3653 2.8344 3.8709 4.5033 3.1841 3.1445 5.7449 2.9834 4.8687 4.7720 1.3633 1.3866 2.8907 1.3451 1.4877 1.6102 1.4901 1.1843 1.4514 1.6534 1.3582 1.2992 1.8157 1.5436 2.6228 1.7295 2.0893 1.4342 3.2504 4.0231 1.2436 1.2846 2.2561 1.0470 1.1384 1.2739 1.0467 1.1478 2.6702 6.5107 6.3455 1.0373 1.0382 1.0969 1.0968 1.0520 1.0986 1.0978 1.0905 1.0908 1.0882 1.0955 1.1195
irintensity: 3.2396 4.3146 0.4227 3.1290 1.2858 2.4654 2.9505 1.1486 1.8854 4.3511 0.7346 5.8270 2.6243 3.4236 5.5043 3.4608 11.4101 3.6033 6.2269 45.9292 21.1870 5.9033 3.4299 4.6268 16.2209 0.1449 5.7589 0.9941 17.0046 0.0058 9.1959 2.3489 10.3526 0.7624 2.7219 0.7041 1.6902 2.0695 15.7925 0.0992 5.9709 17.8186 5.1627 0.1078 8.6643 23.2508 30.4375 0.6888 21.8564 1.6437 3.7013 63.5315 12.0059 44.8259 0.2510 34.6267 33.8826 7.4560 18.2645 28.0497 13.4746 8.6004 34.6022
temp: 298.150 k
press: 1.00000 atm
elementType: 8 6 6 6 6 6 6 6 6 6 6 1 1 1 1 1 1 1 1 1 1 1 1
symmnumber: 1
zpe: 498305.2 jmol-1
zpe.correction: 0.189794 hartree
zpe.thermalcorrener: 0.200627 hartree
zpe.thermalcorrenthalpy: 0.201572 hartree
zpe.thermalcorrgfe: 0.153165 hartree
zpe.sumelectzpe: -462.633791 hartree
zpe.sumelectthermal: -462.622958 hartree
zpe.sumelectthermalent: -462.622014 hartree
zpe.sumelectthermalfe: -462.670420 hartree
dipole: -1.9607 1.2441 1.7940
dipole: 2.9344
quadrupole: -63.6644 -59.7383 -69.0773
quadrupole: 3.8173 6.8638 -1.3794
quadrupole: 0.4956 4.4217 -4.9173 3.8173 6.8638 -1.3794
hfenergy: -462.8235851 hartree
pointgroup: C01 [X(C10H12O1)]
dipole: 0.6999705 0.6750758 -0.6222024 debye
dipolederiv: -0.5963679 -0.0341643 0.1038976 -0.1642975 -0.4254703 0.1538088 0.274303 0.1292859 -0.4331581 0.4569573 -0.0353508 -0.0366789 -0.0393215 0.2727285 0.0704517 -0.3225672 0.0181477 0.239501 0.1543877 -0.1022213 -0.0626048 -0.0410059 0.1804205 -0.0629446 0.015228 0.0103014 0.2453965 0.1370621 0.0043874 0.0261215 -0.0439069 -0.0647545 -0.0227354 0.0646441 -0.0201 -0.0583939 -0.165114 -0.1042483 -0.0417822 -0.0143816 0.0244303 0.0502504 0.0118295 0.0607207 -0.1684696 -0.1046005 0.0357138 -0.013202 0.0847568 -0.0234493 0.0276792 -0.0535055 0.0028445 -0.1412573 0.0932007 0.2118378 0.0327781 0.2840883 0.1382449 0.0148266 0.0433831 0.014149 -0.0339283 0.286087 -0.1050575 -0.0633751 -0.1335985 -0.10483 0.0035556 -0.0695761 0.0016816 -0.0451226 -0.1098772 0.0086728 -0.0071036 -0.0739275 0.0998194 0.0592254 -0.0191611 0.0537795 -0.1545833 -0.0705322 -0.1361517 -0.019308 -0.079733 0.0053996 -0.0056583 -0.0046263 0.002403 0.0657215 -0.1503397 0.0433589 0.0310793 -0.0273417 0.087956 0.0053792 0.0145249 -0.0001731 0.0678314 -0.0129985 -0.0211004 0.0019382 0.038556 -0.0809035 -0.0968128 0.0399555 -0.0963074 0.0444839 -0.1388493 0.1172195 -0.0505812 0.10693 0.0360366 0.0401592 -0.056974 0.0143322 0.0340087 0.0891365 0.0679143 0.050723 0.052328 0.0349814 -0.0803837 0.001306 -0.0453958 -0.0877766 0.0672382 0.0531847 0.0248112 0.0600711 -0.0940583 -0.0630074 0.0249267 -0.0637815 0.1263467 0.0310242 -0.0930458 -0.0062534 -0.0874519 0.0257495 -0.0256465 -0.0048329 -0.0111276 0.1448327 0.0463191 0.0735998 0.0260204 0.0604036 -0.098043 -0.0578614 0.030889 -0.058962 0.1311514 0.0442967 0.1417776 0.0416132 0.0278355 -0.0996419 -0.0522755 0.0136395 -0.0650958 0.0906442 -0.0545646 -0.0216519 -0.1162957 0.0223111 0.0491644 0.0637603 -0.1359863 0.0081353 -0.0069495 -0.0018183 -0.0677544 0.088939 -0.0499039 0.0603563 -0.0131383 0.1252791 0.0497672 -0.0718825 -0.0183945 -0.0134008 0.0624439 -0.0538555 0.0222716 0.1217125 0.1165026 0.0798229 -0.0256836 -0.0596097 0.0055093 -0.0699007 -0.0165403 0.0935393 -0.0633797 -0.133836 -0.0292808 -0.0560982 0.0773568 -0.0290288 -0.00328 0.087985 -0.1399475 -0.0669653 0.0246545 -0.0551468 0.0933855 unknown
polarizability: 153.7545536|3.3692305|106.8053005|-2.2827727|10.2959407|67.3132316 unknown
InChI: InChI=1S/C10H12O/c1-7-3-4-9(5-8(7)2)10-6-11-10/h3-5,10H,6H2,1-2H3
charge 0 multiplicity 1
23 atoms
O  -3.264218 -0.572706 0.811703
C  -2.314585 0.556683 0.458231
C  -3.390757 0.138234 -0.508653
C  -0.878372 0.199318 0.252107
C  0.120176 1.196426 0.378002
C  -0.487522 -1.118994 -0.083387
C  1.489378 0.914498 0.158672
C  1.877098 -0.415561 -0.191172
C  0.874407 -1.41176 -0.300197
C  2.528799 2.012175 0.301583
C  3.335291 -0.763966 -0.429352
H  -2.498459 1.469725 1.041522
H  -4.292409 0.753975 -0.619893
H  -3.101569 -0.458802 -1.383084
H  -0.173138 2.218941 0.651483
H  -1.247643 -1.906362 -0.135908
H  1.171539 -2.436863 -0.552942
H  2.062845 2.972257 0.581424
H  3.280133 1.762547 1.075615
H  3.087175 2.169241 -0.641572
H  3.770069 -0.162518 -1.251102
H  3.953687 -0.567301 0.467989
H  3.452875 -1.828986 -0.69197
