program: Gaussian 09
title: 000159630
version: EM64L-G09RevD.01
frameworkgroup: C1[X(C6H10O6)]
method: RPBEPBE
basis: SDD
operation: Freq
keyword: #pfreq=noraman
keyword: PBEPBE/SDD
title: #p freq=noraman PBEPBE/SDD
converged: YES YES NO NO
title: Mulliken charges:
elementType: O O O O O O C C C C C C H H H H H H H H H H
charge: -0.452821 -0.506032 -0.485003 -0.487903 -0.174468 -0.135882 -0.096005 -0.038427 -0.167380 -0.363966 0.113519 -0.155172 0.222991 0.231925 0.276187 0.206063 0.237078 0.383275 0.384659 0.380808 0.366302 0.260250
chargesum: 0.00000
title: Mulliken charges with hydrogens summed into heavy atoms:
elementType: O O O O O O C C C C C C
charge: -0.069546 -0.121373 -0.104195 -0.121600 -0.174468 -0.135882 0.126987 0.193498 0.108807 0.079175 0.113519 0.105078
polarizability: 1.12504287e+02 4.64518660e+00 9.07631151e+01 1.09970506e+00 4.67807306e-01 6.03342104e+01
1716.lowfreq: -9.3999 -6.0603 -0.0009 -0.0007 -0.0005 11.2913 29.5040 51.3121 72.3840
frequency: 29.1501 51.2799 72.3827 104.1766 104.9956 136.2118 163.1558 219.2542 253.3760 260.6069 284.1307 318.0225 354.0989 382.0771 401.5906 429.4494 463.5780 511.8318 525.1971 568.1884 642.3670 691.6258 737.4086 849.3284 861.4405 894.9862 965.1920 973.9730 993.2601 1017.6906 1046.1588 1050.7448 1078.0324 1101.6041 1175.6753 1188.3408 1224.7707 1236.8788 1251.7229 1268.4167 1311.7258 1324.9600 1353.4651 1364.9157 1381.0415 1394.9570 1418.6650 1467.1324 1586.1723 1636.5279 2945.7869 2964.0499 2969.1522 2985.1247 3019.9657 3057.3363 3329.8297 3384.0377 3507.2165 3605.9309
redmass: 7.5398 7.1653 8.6295 3.5448 3.8376 6.9313 3.6681 5.6012 2.6334 1.4577 4.6439 7.8205 6.7341 5.0755 3.0752 3.5610 1.3253 1.6299 1.7685 4.2104 1.9726 1.6011 4.2341 4.7363 2.6482 4.8593 4.2706 2.4303 5.7269 3.8937 2.6975 2.1308 2.3814 2.5550 1.1727 1.2047 1.1521 1.3725 1.2238 1.2620 1.2183 1.1976 1.2761 1.3290 1.2591 1.3647 1.6081 1.0818 11.0325 7.2308 1.0918 1.0810 1.0658 1.0826 1.0839 1.1034 1.0638 1.0644 1.0650 1.0670
irintensity: 0.5480 0.8401 1.5452 11.1373 10.1118 12.7016 10.4017 9.6549 44.6672 101.7435 9.1146 29.8135 14.5670 7.1256 0.2056 30.6477 92.7846 72.0629 121.5602 12.6250 57.4614 86.2046 15.2935 74.4172 15.4885 9.9291 35.5265 19.8012 61.6531 201.4438 25.9537 31.9512 1.2036 21.8799 15.1470 13.0322 9.3219 52.4038 29.1074 30.6788 18.5068 34.8026 57.2146 90.4226 40.1245 30.3482 11.9090 8.8406 175.8056 20.8969 9.6565 4.2843 24.7483 93.2998 6.1175 37.0309 103.3077 46.5661 45.3218 11.8677
temp: 298.150 k
press: 1.00000 atm
elementType: 8 8 8 8 8 8 6 6 6 6 6 6 1 1 1 1 1 1 1 1 1 1
symmnumber: 1
zpe: 429999.9 jmol-1
zpe.correction: 0.163778 hartree
zpe.thermalcorrener: 0.177269 hartree
zpe.thermalcorrenthalpy: 0.178213 hartree
zpe.thermalcorrgfe: 0.122741 hartree
zpe.sumelectzpe: -684.953063 hartree
zpe.sumelectthermal: -684.939573 hartree
zpe.sumelectthermalent: -684.938628 hartree
zpe.sumelectthermalfe: -684.994100 hartree
dipole: -4.8738 -0.1555 -0.3918
dipole: 4.8920
quadrupole: -70.8048 -75.3180 -72.1037
quadrupole: -9.8865 -8.6348 -0.0843
quadrupole: 1.9374 -2.5758 0.6384 -9.8865 -8.6348 -0.0843
hfenergy: -685.1168415 hartree
pointgroup: C01 [X(C6H10O6)]
dipole: 1.9229811 0.0563697 -0.0574916 debye
dipolederiv: -0.6879571 0.0360335 0.0356738 0.0604212 -0.4635646 -0.1610575 0.0742421 -0.2165271 -0.7456973 -0.4612079 -0.0260473 0.0488527 -0.0738849 -0.5826284 -0.0610915 0.0113327 -0.0646526 -0.769882 -0.4249829 -0.1221166 0.0754115 -0.1931277 -0.7484654 -0.0989462 0.0489859 -0.0562731 -0.5206498 -0.8356782 0.0276074 -0.2013092 0.0230633 -0.4767204 -0.1507429 -0.2474637 -0.1698332 -0.4291701 -0.8495158 -0.0099875 -0.001759 -0.0777446 -0.4575476 -0.1398497 -0.2724349 -0.1276789 -0.3212659 -0.5779473 0.189078 0.1199996 0.2235434 -0.5388147 -0.1873538 0.0495987 -0.1235331 -0.3739298 0.4364766 -0.079227 -0.0257087 0.0844081 0.3317159 0.1280929 -0.0786978 0.2076679 0.5013506 0.2034631 -0.0393408 -0.0810876 -0.0151905 0.4028433 0.102491 0.1050806 0.1286969 0.3988368 -0.4062027 0.2775372 0.1871851 0.1439943 0.3569456 0.0703153 0.1927315 0.0325145 0.2100022 0.5355216 -0.0179089 0.251908 0.0133263 0.3004725 0.0883527 0.1729711 0.0527684 0.2527505 1.1497973 -0.1622599 -0.1013968 -0.1683333 0.305809 0.0902991 0.1459327 0.0637257 0.1567003 0.6865217 -0.1028567 0.0394477 -0.242178 0.5184174 0.301083 -0.0122697 0.2615802 0.3880438 0.0107849 0.0483359 -0.0025235 0.1114022 -0.1594209 -0.0460808 -0.0306576 0.0076764 0.0347601 0.0006516 0.0547133 0.0120241 0.0587613 -0.1595174 -0.008382 0.0082025 0.0234494 -0.0089969 0.1300589 0.0073634 -0.0497256 0.0559956 0.0633407 0.0104192 -0.0106376 -0.0268474 -0.0334877 -0.0318013 0.0799635 -0.0802834 0.0625658 -0.1315888 0.0801005 -0.0760414 0.0210616 0.0185226 0.0168616 0.0383693 0.0442436 0.0381119 0.0471199 -0.0919793 0.0068112 -0.0693485 -0.0836413 0.4281622 -0.0025276 -0.0729649 -0.0262428 0.2850488 0.0205559 -0.0671097 0.0332572 0.3642545 0.2056431 0.0061807 -0.0808923 0.0225009 0.3387394 -0.061413 -0.0656607 -0.0514108 0.3674628 0.219719 -0.0583901 -0.0778977 0.0658858 0.419947 0.0576358 0.0121273 0.017298 0.3113267 0.2245622 -0.1200204 0.0545851 -0.1418804 0.2897687 0.0903643 0.092741 0.112604 0.223242 0.0270694 -0.0244994 -0.0937824 -0.0253977 0.0581 -0.0328132 -0.0597845 -0.0561955 0.0594678 unknown
polarizability: 112.2851287|0.5922469|77.187646|-6.531815|14.7375087|74.1288374 unknown
InChI: InChI=1S/C6H10O6/c7-1-3(9)5(11)6(12)4(10)2-8/h1,4-6,8,10-12H,2H2
charge 0 multiplicity 1
22 atoms
O  0.724367 -0.675987 -1.961903
O  1.442156 0.575914 1.448025
O  -0.875684 -2.178962 -0.62843
O  3.938636 0.913771 0.49466
O  -2.950563 -0.542473 -0.216888
O  -2.744912 1.832482 1.446351
C  0.491113 -0.103195 -0.652607
C  1.79666 -0.044791 0.159568
C  -0.595675 -0.971193 0.133243
C  2.881563 0.785753 -0.530752
C  -1.879581 -0.173406 0.335161
C  -1.774112 1.071423 1.238851
H  0.128818 0.935506 -0.799624
H  2.178892 -1.073955 0.32951
H  -0.174584 -1.245157 1.118659
H  2.482974 1.783883 -0.807791
H  3.240598 0.261931 -1.435554
H  0.294614 -1.584142 -1.942661
H  2.299399 0.859926 1.865344
H  -1.845238 -2.150847 -0.880453
H  4.686982 1.461617 0.155013
H  -0.769224 1.225603 1.69528
