program: Gaussian 09
title: 000159496
version: EM64L-G09RevD.01
frameworkgroup: C1[X(C7H15NO5)]
method: RPBEPBE
basis: SDD
operation: Freq
keyword: #p
keyword: freq=noraman
keyword: PBEPBE/SDD
title: #p freq=noraman PBEPBE/SDD
converged: YES YES NO NO
title: Mulliken charges:
elementType: O O O O O N C C C C C C C H H H H H H H H H H H H H H H
charge: -0.459416 -0.468403 -0.468859 -0.435085 -0.462217 -0.385465 -0.186862 -0.156955 -0.065720 -0.176632 -0.141390 -0.358789 -0.370183 0.227310 0.240686 0.242052 0.251307 0.228581 0.305029 0.244443 0.187005 0.208556 0.225852 0.362354 0.352092 0.362228 0.345694 0.352786
chargesum: 0.00000
title: Mulliken charges with hydrogens summed into heavy atoms:
elementType: O O O O O N C C C C C C C
charge: -0.097062 -0.116311 -0.106631 -0.089391 -0.109430 -0.080437 0.040448 0.083732 0.176332 0.074675 0.087190 0.072659 0.064225
polarizability: 1.08070915e+02 -9.80371312e-01 1.01268006e+02 -2.81511629e+00 1.42034952e+00 8.44060308e+01
1716.lowfreq: -10.8786 0.0005 0.0006 0.0012 5.1392 17.0565 63.2040 76.8424 99.1119
frequency: 63.1649 76.8047 99.0614 117.9249 137.6256 179.9307 215.9242 239.2168 251.6216 267.7933 281.1160 297.5056 315.0002 330.5981 392.6111 405.6193 423.9813 443.8222 464.0825 482.4497 506.7536 572.3757 585.8181 645.1311 686.3123 792.7477 838.2443 880.3451 930.1161 947.2528 966.3130 974.8263 994.6856 1012.4116 1037.4584 1050.2132 1057.9951 1080.0993 1088.8319 1121.4332 1133.7725 1170.3259 1182.4096 1193.9189 1210.4096 1214.8307 1231.4473 1265.2343 1271.3174 1295.5786 1311.2180 1316.7260 1325.3639 1343.3968 1348.9116 1385.6663 1390.8712 1395.0028 1397.0666 1402.7615 1463.1387 1479.3705 1485.9758 2922.8287 2942.5438 2960.3921 2969.6500 2985.4108 2994.4480 3003.4934 3031.8252 3092.6697 3399.4791 3419.6872 3553.6541 3561.7598 3581.3801 3587.6126
redmass: 6.2141 5.6308 5.1456 5.5960 4.0938 3.4301 4.0939 4.4121 3.2075 2.2882 1.3219 2.9960 1.3863 2.4166 3.4866 2.0311 1.6720 1.2570 2.8634 3.9839 2.9597 2.4368 1.7145 3.2147 3.2206 2.2097 2.3171 3.4682 1.9742 3.4853 2.9722 4.1271 2.8558 3.7450 4.4435 2.8879 2.0606 2.1372 1.9870 1.6936 1.8432 1.1800 1.2433 1.2157 1.1709 1.3919 1.3562 1.3721 1.2927 1.2758 1.2732 1.2557 1.3775 1.3136 1.3053 1.6093 1.3245 1.3715 1.4950 1.4836 1.2792 1.0804 1.1512 1.0767 1.0763 1.0676 1.0719 1.0835 1.0845 1.0864 1.1056 1.0928 1.0642 1.0735 1.0653 1.0656 1.0666 1.0668
irintensity: 3.0280 2.7888 4.5709 4.9427 6.4091 12.9939 10.2549 7.3080 7.7584 14.4046 130.8123 44.4502 75.1800 36.6660 2.4684 46.2016 66.8798 183.1753 7.9082 25.1231 43.0528 32.6969 90.8635 53.6588 43.6309 109.5802 40.1653 17.1494 34.4504 48.5571 51.7900 122.0812 1.8015 18.7375 56.2121 86.7949 33.6255 6.7573 50.3810 21.9518 17.3015 40.8314 5.6382 26.8009 17.8437 1.5836 21.9117 22.8040 35.6041 17.2556 22.5152 20.0168 8.3144 11.0672 9.3405 9.9224 51.5747 16.2688 4.3538 7.9071 9.1513 10.0166 2.3086 19.7776 108.0944 24.8705 21.3336 9.2018 33.7426 73.3881 63.0968 15.1382 47.3693 3.7804 15.7227 18.2688 9.5513 5.6912
temp: 298.150 k
press: 1.00000 atm
elementType: 8 8 8 8 8 7 6 6 6 6 6 6 6 1 1 1 1 1 1 1 1 1 1 1 1 1 1 1
symmnumber: 1
zpe: 606965.9 jmol-1
zpe.correction: 0.231181 hartree
zpe.thermalcorrener: 0.245303 hartree
zpe.thermalcorrenthalpy: 0.246248 hartree
zpe.thermalcorrgfe: 0.191340 hartree
zpe.sumelectzpe: -705.494586 hartree
zpe.sumelectthermal: -705.480464 hartree
zpe.sumelectthermalent: -705.479520 hartree
zpe.sumelectthermalfe: -705.534427 hartree
dipole: -5.6980 -0.5928 -0.6834
dipole: 5.7694
quadrupole: -82.9175 -77.5543 -75.0580
quadrupole: 1.8436 -4.8676 6.8581
quadrupole: -4.4075 0.9556 3.4520 1.8436 -4.8676 6.8581
hfenergy: -705.7257675 hartree
pointgroup: C01 [X(C7H15N1O5)]
dipole: -2.2274358 0.3294794 0.2866787 debye
polarizability: 108.1953871|0.7465267|101.2316712|2.6222018|1.0606223|84.3178934 unknown
InChI: InChI=1S/C7H15NO5/c9-1-3-5(11)7(13)6(12)4(2-10)8-3/h3-13H,1-2H2
charge 0 multiplicity 1
28 atoms
O  1.84542 -1.445967 1.371635
O  -2.57696 -1.312774 -0.6222
O  -0.275574 -2.864024 0.014423
O  2.799847 1.005409 -1.36687
O  -1.974766 2.732653 0.67891
N  0.179395 1.285025 -0.551491
C  1.125714 0.643285 0.411778
C  -1.231635 0.816337 -0.52347
C  1.071442 -0.889506 0.257104
C  -1.232573 -0.713431 -0.751676
C  -0.364985 -1.424044 0.291088
C  2.53709 1.17382 0.063993
C  -1.995233 1.257506 0.743049
H  0.910183 0.878674 1.479021
H  -1.745272 1.303281 -1.376838
H  1.524761 -1.177584 -0.714666
H  -0.815763 -0.914747 -1.76017
H  -0.798793 -1.268667 1.302422
H  0.191599 2.311097 -0.443122
H  3.299913 0.596947 0.610183
H  2.6146 2.245973 0.352809
H  -1.492923 0.900618 1.665229
H  -3.029783 0.862537 0.718855
H  1.794534 -2.433282 1.29644
H  -3.102364 -1.12835 -1.440038
H  -1.203199 -3.206707 -0.063643
H  1.914039 1.165528 -1.804168
H  -2.452115 3.109295 1.45851
