program: Gaussian 09
title: 000159640
version: EM64L-G09RevD.01
frameworkgroup: C1[X(C17H16N2O6)]
method: RPBEPBE
basis: SDD
operation: Freq
keyword: #p
keyword: freq=noraman
keyword: PBEPBE/SDD
title: #p freq=noraman PBEPBE/SDD
converged: YES YES NO NO
title: Mulliken charges:
elementType: O O O O O O N N C C C C C C C C C C C C C C C C C H H H H H H H H H H H H H H H H
charge: -0.288910 -0.256150 -0.422258 -0.494816 -0.441930 -0.229035 -0.167454 0.051400 -0.008332 0.476594 -0.108167 -0.485990 -0.112235 0.146372 0.238818 -0.410158 -0.376379 0.233110 -0.358660 0.003951 -0.322938 -0.215461 -0.325702 0.098290 -0.501936 0.236184 0.200129 0.241722 0.261247 0.316334 0.183957 0.284129 0.245954 0.216538 0.204413 0.289950 0.218638 0.225936 0.351138 0.417364 0.384344
chargesum: 0.00000
title: Mulliken charges with hydrogens summed into heavy atoms:
elementType: O O O O O O N N C C C C C C C C C C C C C C C C C
charge: -0.288910 -0.256150 -0.071120 -0.077451 -0.057587 -0.229035 -0.167454 0.051400 -0.008332 0.476594 -0.108167 -0.049677 -0.112235 0.146372 0.238818 -0.168436 -0.115132 0.233110 -0.042327 0.187908 -0.038809 0.030493 0.095249 0.098290 0.232588
polarizability: 3.24056424e+02 1.70806211e+01 3.16325756e+02 -1.54795974e+01 -7.09252702e-02 1.10681566e+02
1716.lowfreq: -3.7679 -0.0007 -0.0006 -0.0004 3.6516 4.8503 27.7116 34.9547 45.0785
frequency: 27.7067 34.9455 45.0734 49.0908 69.4288 83.7733 106.5212 108.1009 129.1698 137.1394 154.2989 190.0149 193.5823 212.8887 220.6941 251.1800 254.3401 271.3133 279.6159 282.3215 306.8403 337.6791 357.3892 387.4031 398.9594 408.1994 424.9335 453.3048 476.8048 489.5273 502.4884 516.0933 529.8555 538.5686 584.2698 587.7570 593.1812 618.5666 632.5967 644.9804 675.6081 715.5234 726.1228 742.2512 770.1803 794.5718 817.6793 843.6182 845.7307 852.5575 926.7473 929.8828 933.2915 954.5022 961.4682 968.7671 974.9057 997.9557 1017.6088 1019.6895 1028.4369 1041.0620 1064.3730 1069.1341 1077.3488 1087.6746 1100.4486 1151.4980 1170.5527 1179.0975 1187.2089 1206.6884 1211.3319 1231.8440 1257.9641 1273.8938 1279.3255 1291.0358 1307.3100 1317.6899 1325.0116 1333.7452 1376.4792 1386.8313 1395.9143 1398.2637 1410.6910 1439.0935 1440.9591 1451.8590 1453.3297 1455.1457 1460.7088 1478.0137 1483.6365 1494.8126 1543.4470 1578.0122 1579.9395 1607.2526 1648.2965 2903.1025 2928.3387 2966.0542 2982.1286 3009.1305 3033.5679 3077.4186 3118.8278 3128.8985 3135.0748 3151.4811 3159.1636 3175.4119 3183.7276 3526.9106 3561.6701
redmass: 5.6690 5.2188 7.0742 5.5092 4.9613 5.4213 5.0305 5.4761 6.3526 3.9789 5.5516 3.7677 2.9975 2.7100 2.2837 2.1983 2.7622 4.9720 3.3751 2.5113 5.0833 4.6803 4.7907 5.3921 4.7305 3.5537 5.7224 4.8958 4.1426 4.3734 4.6706 5.5797 6.2937 4.6346 4.1995 2.2316 4.8222 2.1139 4.9836 5.2731 9.8114 7.1396 6.9619 5.6329 2.9025 2.9669 3.8809 2.6578 2.9028 1.9651 5.9503 7.2785 4.8816 1.6671 1.4207 1.7630 2.9055 1.3495 3.7973 1.4179 3.4485 2.8292 2.8350 2.4643 2.5631 2.0532 1.2667 1.3690 1.4412 1.9497 1.1332 1.1174 1.7342 1.1713 2.0280 2.7983 5.7273 2.6272 2.7442 1.3677 1.9946 1.4000 3.4249 1.5309 1.5483 3.3758 3.4686 1.2499 1.6264 1.5685 1.1308 1.1222 1.2687 2.6765 1.1255 7.2188 6.8636 7.2129 5.7228 6.6258 8.6197 1.0766 1.0845 1.0604 1.0656 1.0297 1.1034 1.0990 1.1037 1.0927 1.0902 1.1058 1.0934 1.0940 1.0952 1.0642 1.0652
irintensity: 0.0613 0.8047 2.0682 4.0612 3.3626 1.3927 7.7485 6.0149 2.6762 0.0921 1.0192 8.5249 2.1060 2.3880 0.6138 79.4517 21.8457 6.7122 10.9034 73.7250 15.2569 8.0008 9.3470 4.6424 9.9771 20.8817 9.4863 21.9123 4.6493 7.0810 0.9336 5.2891 10.5079 12.3527 36.3528 47.6100 43.0355 52.1355 21.2431 23.9689 5.0454 5.3366 22.0863 11.5205 26.1758 46.6651 26.6790 12.6291 37.1666 73.7355 44.5837 96.0630 109.5746 48.5281 53.7572 8.8152 45.7551 132.6932 150.0634 32.1250 136.5416 31.3590 120.8467 30.7440 13.2279 116.7017 1.8561 3.0843 44.7455 20.5709 73.1074 18.1192 24.0540 4.8867 28.7788 34.2866 9.2766 73.7340 34.6681 9.5979 14.6151 40.3624 77.4872 6.7266 26.6711 6.5735 35.1692 89.1327 37.5483 2.9891 11.9798 11.1551 38.1690 121.3873 3.8971 17.3751 92.2228 73.7226 15.1966 20.2015 195.4731 1310.0707 43.5563 76.9832 63.2288 41.9128 11.6233 20.7084 40.3666 28.4679 16.8429 14.1294 10.0186 6.4272 1.9858 50.5723 9.5832
temp: 298.150 k
press: 1.00000 atm
elementType: 8 8 8 8 8 8 7 7 6 6 6 6 6 6 6 6 6 6 6 6 6 6 6 6 6 1 1 1 1 1 1 1 1 1 1 1 1 1 1 1 1
symmnumber: 1
zpe: 805538.5 jmol-1
zpe.correction: 0.306813 hartree
zpe.thermalcorrener: 0.329254 hartree
zpe.thermalcorrenthalpy: 0.330199 hartree
zpe.thermalcorrgfe: 0.254625 hartree
zpe.sumelectzpe: -1216.423273 hartree
zpe.sumelectthermal: -1216.400832 hartree
zpe.sumelectthermalent: -1216.399888 hartree
zpe.sumelectthermalfe: -1216.475461 hartree
dipole: -2.4959 0.7768 -0.5710
dipole: 2.6756
quadrupole: -132.1757 -134.5472 -149.0804
quadrupole: 22.0422 -9.9775 0.0627
quadrupole: 6.4254 4.0539 -10.4793 22.0422 -9.9775 0.0627
hfenergy: -1216.7300867 hartree
pointgroup: C01 [X(C17H16N2O6)]
dipole: 0.9676793 -0.3794694 -0.1665313 debye
polarizability: 322.8153415|14.2421114|312.7742979|34.1723946|11.7205822|115.4741068 unknown
InChI: InChI=1S/C17H16N2O6/c1-24-12-6-5-9(8-25-13(21)7-20)14-16(12)19-15-10(17(22)23)3-2-4-11(15)18-14/h2-6,13,20-22H,7-8H2,1H3
charge 0 multiplicity 1
41 atoms
O  -3.948277 -0.121547 0.071489
O  1.302795 -3.827545 0.057134
O  -5.804867 1.068814 0.896271
O  -2.840883 2.46584 -0.808526
O  4.99532 1.362957 1.099345
O  4.36747 -0.65394 0.152104
N  -0.864844 0.614381 -0.555271
N  1.488361 -0.868742 0.042131
C  -0.909695 -0.75523 -0.5553
C  -2.13481 -1.436449 -0.869524
C  0.315939 -1.507469 -0.228496
C  -3.39233 -0.671854 -1.197124
C  1.528132 0.494627 -0.005549
C  0.315265 1.255799 -0.29069
C  0.260119 -2.964563 -0.214764
C  -2.11766 -2.835417 -0.853728
C  -0.95443 -3.589873 -0.536516
C  2.757894 1.21973 0.257005
C  0.338371 2.692836 -0.285187
C  -4.764588 1.104012 -0.099524
C  2.730622 2.62089 0.266297
C  1.529441 3.353451 -0.00301
C  -3.915281 2.355087 0.167836
C  4.054947 0.514982 0.472699
C  2.631709 -3.401538 0.558656
H  -3.184377 0.155958 -1.900727
H  -4.139375 -1.353096 -1.65279
H  -3.041135 -3.3778 -1.087516
H  -0.982029 -4.682982 -0.533589
H  -0.596112 3.225107 -0.498893
H  -5.175002 1.114955 -1.135598
H  3.658592 3.159107 0.475837
H  1.559604 4.447507 0.00899
H  -4.54056 3.258398 0.065452
H  -3.539334 2.292184 1.209951
H  3.135111 -2.719084 -0.139515
H  3.175933 -4.35194 0.671376
H  2.530093 -2.889339 1.529953
H  -6.209369 0.16401 0.896853
H  -2.174507 1.696575 -0.690057
H  5.853247 0.866402 1.184015
