program: Gaussian 09
title: 000159488
version: EM64L-G09RevD.01
frameworkgroup: C1[X(C4H5I2NO2)]
method: RPBEPBE
basis: SDD
operation: Freq
keyword: #p
keyword: freq=noraman
keyword: PBEPBE/SDD
title: #p freq=noraman PBEPBE/SDD
converged: YES YES NO NO
title: Mulliken charges:
elementType: I I O O N C C C C H H H H H
charge: 0.075366 0.075290 -0.160659 -0.160672 -0.373113 0.333668 0.333655 -0.859703 -0.859523 0.304807 0.325957 0.319475 0.325939 0.319515
chargesum: 0.00000
title: Mulliken charges with hydrogens summed into heavy atoms:
elementType: I I O O N C C C C
charge: 0.075366 0.075290 -0.160659 -0.160672 -0.068306 0.333668 0.333655 -0.214272 -0.214069
polarizability: 1.03339267e+02 1.43671670e-03 1.50922872e+02 -2.04603442e-02 3.52182737e+00 4.42482926e+01
1716.lowfreq: -11.7038 0.0002 0.0002 0.0006 4.3950 8.1353 8.1828 24.1071 50.1923
frequency: -11.6684 24.0427 50.1742 51.7674 110.9416 135.6217 195.9123 301.8383 323.9183 429.0142 503.1496 512.9794 613.3812 637.7671 657.8161 756.8579 835.8887 845.5142 914.1801 932.6319 1132.7761 1138.1709 1183.3193 1191.1427 1212.6711 1233.5301 1407.3029 1409.9294 1449.5181 1612.6278 1651.8098 3053.8501 3053.9169 3150.4652 3150.5748 3389.7990
redmass: 3.6019 5.0090 10.6750 7.0823 14.7256 3.7198 12.8693 11.3481 8.5972 6.5670 4.4971 2.9549 2.7969 5.0497 4.9952 1.1505 1.7655 1.8776 6.6862 6.6555 1.2545 1.2120 2.0161 2.3653 1.2066 1.7293 1.1140 1.0864 2.0795 4.7089 11.5438 1.0599 1.0599 1.1041 1.1041 1.0781
irintensity: 0.6279 13.6306 6.7066 0.1056 3.4358 0.6661 0.3223 1.0371 9.6159 20.2865 22.1871 14.8431 0.6069 39.5076 54.7423 44.5030 0.0303 62.4803 0.0586 0.5546 0.0489 31.1997 114.9336 2.0936 5.2210 71.1058 144.4259 3.3128 943.7307 0.4625 180.9264 0.8122 1.2464 0.2651 0.8482 89.0579
temp: 298.150 k
press: 1.00000 atm
elementType: 53 53 8 8 7 6 6 6 6 1 1 1 1 1
symmnumber: 1
zpe: 234795.8 jmol-1
zpe.correction: 0.089429 hartree
zpe.thermalcorrener: 0.099180 hartree
zpe.thermalcorrenthalpy: 0.100124 hartree
zpe.thermalcorrgfe: 0.048742 hartree
zpe.sumelectzpe: -382.955357 hartree
zpe.sumelectthermal: -382.945606 hartree
zpe.sumelectthermalent: -382.944662 hartree
zpe.sumelectthermalfe: -382.996044 hartree
dipole: 0.0023 -2.9820 1.6298
dipole: 3.3983
quadrupole: -76.5605 -101.9676 -80.8089
quadrupole: 0.0089 -0.0145 4.4781
quadrupole: 9.8851 -15.5219 5.6368 0.0089 -0.0145 4.4781
hfenergy: -383.0447861 hartree
pointgroup: C01 [X(C4H5I2N1O2)]
dipole: -0.0003865 1.2250879 0.5354645 debye
dipolederiv: -0.1722165 -0.0359948 -0.0023079 -0.2120493 -0.4056337 0.0386141 0.049211 0.0770356 -0.0551249 -0.1724945 0.0360713 0.0024495 0.2124686 -0.406457 0.0378211 -0.0486396 0.0761665 -0.0548242 -0.6904072 -0.1114027 0.018871 0.3338602 -0.8678139 -0.023267 -0.012206 -0.1239232 -0.2873943 -0.6903315 0.1119961 -0.0181878 -0.3336287 -0.8682865 -0.0235345 0.0120521 -0.1235937 -0.2876797 -2.2318846 -0.0001747 0.0007205 0.0001416 -0.5696997 -0.0048989 0.0000838 -0.058533 -0.2946046 1.8970878 0.261144 -0.0284495 -0.6877287 0.8293159 0.1012818 0.0334933 0.2098759 0.2336074 1.8965418 -0.2614415 0.0266797 0.6882036 0.8289835 0.1008192 -0.0331336 0.20909 0.2340189 -0.285775 -0.1939794 0.0045919 0.1261406 0.6631582 -0.1513006 -0.095232 -0.1880476 0.0142896 -0.2859883 0.1940999 -0.0042418 -0.1269879 0.6653243 -0.1493542 0.0947606 -0.1863082 0.0133814 0.4512416 -0.0002767 -0.0003633 -0.0005105 0.2767412 -0.031073 -0.0004457 -0.0199603 0.2725094 0.0525203 -0.0135302 0.0336134 0.037802 -0.0601509 -0.0216479 0.058772 0.0447574 0.0961477 0.0894935 -0.0254261 -0.011922 -0.0116076 -0.0124135 0.0744115 -0.0364035 0.0196013 0.0095504 0.0527562 0.0135439 -0.0336601 -0.0375784 -0.0602238 -0.0222283 -0.058901 0.0443133 0.0960773 0.0894564 0.0253709 0.0122062 0.0114747 -0.0128442 0.0743568 0.0365887 0.0195262 0.0100457 unknown
polarizability: 103.339254|-0.0076268|149.479282|-0.034329|-12.8184884|45.6918962 unknown
InChI: InChI=1S/C4H5I2NO2/c5-1-3(8)7-4(9)2-6/h7H,1-2H2
charge 0 multiplicity 1
14 atoms
I  2.351631 2.368006 0.052245
I  -2.35155 2.368478 0.057956
O  1.431429 -1.907007 0.247656
O  -1.430892 -1.907404 0.247672
N  0.000013 -0.036303 0.424958
C  1.256158 -0.670886 0.370685
C  -1.255897 -0.671219 0.370593
C  2.497979 0.210022 0.554547
C  -2.49819 0.209127 0.554263
H  -0.000175 0.993382 0.468201
H  3.304361 -0.190398 -0.075053
H  2.80943 0.188639 1.612397
H  -3.303333 -0.189822 -0.077865
H  -2.811663 0.184786 1.611446
