program: Gaussian 09
title: 000159501
version: EM64L-G09RevD.01
frameworkgroup: C1[X(C16H10F2N2O3)]
method: RPBEPBE
basis: SDD
operation: Freq
keyword: #p
keyword: freq=noraman
keyword: PBEPBE/SDD
title: #p freq=noraman PBEPBE/SDD
converged: NO YES NO NO
title: Mulliken charges:
elementType: F F O O O N N C C C C C C C C C C C C C C C C H H H H H H H H H H
charge: -0.199650 -0.200823 -0.169968 -0.274264 -0.217750 -0.405454 -0.402327 -0.211698 0.429737 0.375872 0.024990 0.193528 0.156096 -0.635531 -0.594816 0.263526 0.179527 -0.345919 0.372750 -0.546502 0.346783 -0.385602 -0.528091 0.328017 0.285510 0.283174 0.354414 0.286462 0.269384 0.258363 0.249461 0.232138 0.228665
chargesum: 0.00000
title: Mulliken charges with hydrogens summed into heavy atoms:
elementType: F F O O O N N C C C C C C C C C C C C C C C C
charge: -0.199650 -0.200823 -0.169968 -0.274264 -0.217750 -0.077436 -0.047912 -0.211698 0.429737 0.375872 0.024990 0.193528 0.156096 -0.350021 -0.311642 0.263526 0.179527 -0.059457 0.372750 -0.277119 0.346783 -0.127239 0.182172
polarizability: 2.52193169e+02 -1.74607184e+00 2.41450839e+02 -5.52305932e+00 5.76229046e+00 1.11160415e+02
1716.lowfreq: -5.8561 -3.2619 -0.0009 -0.0009 -0.0005 2.0039 34.4706 45.6391 62.9503
frequency: 34.4114 45.6256 62.9442 80.2685 90.0938 119.7902 128.4309 151.9862 191.9309 193.5656 202.6802 246.4957 252.4212 263.0461 271.5097 291.5177 307.6421 338.0232 380.2084 394.2552 411.3249 457.0386 464.4892 504.2352 506.7665 524.3074 528.2974 568.2276 599.0473 602.1835 607.9439 623.9476 642.0842 655.7811 666.2567 702.2279 706.6381 724.1293 758.5518 779.6734 797.1930 833.8640 839.3787 845.1271 870.7703 884.2966 917.8835 963.7756 964.9582 981.7393 991.8856 998.4026 1052.8711 1084.3985 1112.3020 1113.2149 1125.9975 1148.4043 1157.5268 1178.8130 1198.9950 1211.9346 1253.8633 1269.5486 1296.8159 1306.9855 1314.7683 1362.1905 1377.9141 1388.5331 1429.7322 1441.1114 1443.1698 1458.6535 1468.8244 1472.8275 1496.6844 1601.3426 1608.0041 1618.0162 1618.4782 1690.5960 1725.7296 2972.1292 3066.1755 3134.7920 3163.9742 3170.4312 3175.9800 3189.3829 3192.3466 3586.1674 3605.5913
redmass: 6.8444 11.3213 7.6130 5.3129 5.9755 6.2301 4.9412 7.9383 3.1450 2.6860 4.2385 6.3614 6.9426 2.1602 5.6662 6.8393 8.7805 8.1480 6.2239 7.7258 5.1825 2.9950 5.2377 10.1224 1.3692 4.8868 5.6812 3.8745 6.1845 4.0759 6.6334 2.8878 4.4076 2.2846 2.8744 5.9970 5.3679 6.8054 4.3669 5.5381 3.5879 3.9879 1.6484 1.7421 1.7546 1.5679 8.1915 1.4750 3.4835 3.4199 5.7835 5.1941 7.3285 2.6244 1.6461 1.2704 1.6119 2.6633 1.4251 5.8773 1.8675 2.3240 1.9175 2.9371 6.1474 3.6046 2.2069 1.7500 5.4535 5.8961 2.0638 4.0905 2.0568 2.5617 1.0503 1.1595 4.5413 8.4862 7.5176 9.6449 7.6256 8.7330 9.8072 1.0323 1.1047 1.1005 1.0935 1.0898 1.0938 1.0916 1.0966 1.0802 1.0804
irintensity: 0.7338 0.0386 0.4502 0.4660 0.8384 0.1299 5.2489 1.9363 1.7376 1.6734 0.0866 2.2323 1.9339 1.5064 2.1636 1.6226 0.7549 3.4091 3.7553 9.3460 2.5652 10.1510 9.9612 31.7234 72.4701 1.3810 6.5143 7.5196 5.1666 8.4034 0.3330 18.8149 11.0538 47.2031 58.5305 8.2744 25.2179 63.5396 22.4232 21.9941 11.5303 15.8736 4.1806 41.2470 33.6986 22.2758 27.6580 0.6311 5.6101 30.1971 27.7726 16.2807 75.3923 16.8207 47.0579 2.1077 10.1871 14.8961 8.4746 150.1555 26.5863 33.5939 43.3354 50.5761 110.2511 247.5192 55.5060 9.9998 5.0189 2.8690 7.0131 135.9745 52.0327 99.8213 15.0217 25.4880 5.6481 16.8054 101.6636 92.3389 14.7026 574.1613 422.3386 64.7093 36.0855 14.4238 1.0538 2.8337 0.9246 1.0085 2.4058 92.0309 48.0653
temp: 298.150 k
press: 1.00000 atm
elementType: 9 9 8 8 8 7 7 6 6 6 6 6 6 6 6 6 6 6 6 6 6 6 6 1 1 1 1 1 1 1 1 1 1
symmnumber: 1
zpe: 605636.3 jmol-1
zpe.correction: 0.230675 hartree
zpe.thermalcorrener: 0.249400 hartree
zpe.thermalcorrenthalpy: 0.250344 hartree
zpe.thermalcorrgfe: 0.183587 hartree
zpe.sumelectzpe: -1149.007556 hartree
zpe.sumelectthermal: -1148.988831 hartree
zpe.sumelectthermalent: -1148.987887 hartree
zpe.sumelectthermalfe: -1149.054644 hartree
dipole: -4.6015 2.6027 -1.1419
dipole: 5.4085
quadrupole: -122.1876 -135.0765 -137.5911
quadrupole: -13.6670 5.0818 -6.0111
quadrupole: 9.4308 -3.4581 -5.9727 -13.6670 5.0818 -6.0111
hfenergy: -1149.2382312 hartree
pointgroup: C01 [X(C16H10F2N2O3)]
dipole: -1.7632927 1.1038701 -0.4472769 debye
polarizability: 252.0163773|-2.2051385|241.6066529|-5.283019|6.2119529|111.1813926 unknown
InChI: InChI=1S/C16H10F2N2O3/c1-23-12-6-8(18)5-11-13(12)9-3-2-7(17)4-10(9)16(11)14(21)19-15(22)20-16/h2-6,19-20H,1H3
charge 0 multiplicity 1
33 atoms
F  -3.793533 -2.791826 -0.201576
F  3.669074 3.363639 -0.18978
O  1.125129 -1.178089 2.419576
O  -2.999033 2.031274 -0.03027
O  3.042077 -3.476847 -1.22383
N  1.527233 -1.642157 -1.102794
N  2.248498 -2.527258 0.824599
C  0.858194 -0.83128 -0.07553
C  -0.677997 -0.849891 -0.115425
C  1.166961 0.671953 -0.110562
C  -1.175218 0.479017 -0.080054
C  -0.043893 1.423242 -0.077528
C  1.402003 -1.50056 1.247143
C  -1.518728 -1.973033 -0.15735
C  2.422025 1.293324 -0.147942
C  -2.57615 0.700546 -0.071779
C  2.350618 -2.640779 -0.600731
C  -0.00231 2.834711 -0.067817
C  -2.898289 -1.704636 -0.155602
C  -3.453782 -0.412696 -0.110819
C  2.424723 2.702739 -0.146466
C  1.25476 3.483128 -0.103364
C  -4.445725 2.28917 -0.001567
H  1.41341 -1.490248 -2.10322
H  -1.146117 -2.999749 -0.189675
H  3.362852 0.736037 -0.177431
H  2.756825 -3.150107 1.452952
H  -0.928765 3.411604 -0.035372
H  -4.540858 -0.3066 -0.109759
H  1.335989 4.573827 -0.10005
H  -4.54016 3.383609 0.038784
H  -4.910096 1.839457 0.896007
H  -4.935718 1.904081 -0.915665
