program: Gaussian 09
title: 000159477
version: EM64L-G09RevD.01
frameworkgroup: C1[X(C15H14N2O)]
method: RPBEPBE
basis: SDD
operation: Freq
keyword: #p
keyword: freq=noraman
keyword: PBEPBE/SDD
title: #p freq=noraman PBEPBE/SDD
converged: YES YES NO NO
title: Mulliken charges:
elementType: O N N C C C C C C C C C C C C C C C H H H H H H H H H H H H H H
charge: -0.258284 -0.268992 -0.144298 0.400392 0.328289 -0.546716 -0.357727 -0.352509 0.202744 -0.151993 0.323737 -0.348831 -0.661849 -0.360683 -0.377842 -0.240255 -0.244965 -0.246309 0.247310 0.288781 0.234427 0.220795 0.234916 0.248977 0.230353 0.250546 0.224916 0.228511 0.221053 0.225139 0.222415 0.227951
chargesum: 0.00000
title: Mulliken charges with hydrogens summed into heavy atoms:
elementType: O N N C C C C C C C C C C C C C C C
charge: -0.258284 -0.268992 -0.144298 0.400392 0.328289 -0.299406 -0.068946 0.102713 0.202744 0.082923 0.323737 -0.099854 0.043966 -0.132172 -0.156789 -0.015116 -0.022550 -0.018358
polarizability: 2.96203401e+02 1.43480098e+01 1.99246051e+02 4.61224886e+00 -1.43814546e+01 8.54114073e+01
1716.lowfreq: -9.1933 -3.8771 -0.0007 -0.0005 0.0002 2.1618 23.1460 54.2168 69.9266
frequency: 23.1250 54.1909 69.9224 77.4152 95.7497 156.4849 170.0563 194.1394 233.8159 244.4673 254.9020 329.9400 358.9155 378.2439 401.4299 438.6233 467.7139 501.3562 531.0210 550.8894 592.4206 616.4823 620.7809 624.7114 653.4144 695.0574 697.7927 712.4283 760.5642 762.4952 767.1028 790.5754 796.2055 806.8464 845.7879 912.7986 915.7841 916.7576 943.8565 972.8652 988.7291 992.3436 1013.8041 1024.6733 1037.5859 1059.0179 1080.5136 1085.4971 1139.9184 1153.7927 1172.7032 1193.5183 1199.1223 1216.5596 1243.7385 1257.4935 1308.6709 1334.4352 1342.5345 1345.1853 1366.3370 1377.1338 1390.0164 1396.3218 1415.6308 1444.5708 1465.8998 1473.0143 1478.9394 1490.5891 1543.6037 1572.4935 1583.6491 1599.7544 1618.2111 1637.4356 2994.3801 3012.3102 3067.0389 3093.0987 3104.4209 3121.5346 3127.4544 3140.5274 3148.7036 3164.7430 3165.5548 3210.6964 3221.0295 3252.3227
redmass: 3.6839 3.3353 4.5821 4.2684 3.6690 4.5225 5.2165 1.2122 4.0723 7.2213 2.6705 5.0244 3.5587 4.1505 2.7969 4.7707 5.1305 3.4450 4.7281 5.5662 3.5136 5.8586 3.7774 6.3885 2.0587 2.2594 2.1183 4.8718 3.5275 1.5379 1.6662 1.7482 1.2835 2.0061 1.2580 1.2902 3.6692 1.7705 2.5255 1.4038 5.8764 1.3173 2.4629 2.5318 1.9349 3.2262 1.6342 1.9955 1.8947 1.8310 1.0697 1.2022 1.2846 2.2095 2.4185 1.5057 1.7464 3.3709 1.4008 1.7124 2.4904 5.6426 1.7410 2.4885 3.3596 2.5558 1.0495 2.0013 1.1746 1.0959 4.8325 5.7174 6.1839 7.9260 6.0628 8.7720 1.0357 1.0608 1.1032 1.0997 1.1020 1.0844 1.0869 1.0920 1.0964 1.1016 1.0909 1.0957 1.0970 1.0978
irintensity: 0.5786 0.7719 0.2542 1.3647 1.7478 2.1780 1.4725 0.1479 0.2165 2.1896 1.2043 0.4758 2.8636 1.9550 0.0227 2.0359 6.8469 11.6457 4.0720 8.1061 7.0690 0.3182 1.6297 0.7479 0.8461 18.7943 14.3820 8.3521 5.1179 100.3504 43.2939 72.7796 9.0779 9.0767 0.0977 0.0626 1.2080 3.3663 5.7290 0.1571 0.0968 0.1263 8.4411 4.2287 14.5702 16.7822 9.8260 16.4424 22.2701 73.6857 2.3166 4.9286 7.2955 83.3364 43.5299 13.2349 3.9358 13.6167 30.4120 18.4204 5.9902 2.4633 25.1328 6.2314 48.3275 20.5579 11.9362 17.8201 4.3058 15.3780 20.5715 30.5976 11.2678 146.1540 17.6669 496.6461 18.8729 35.1583 3.3394 33.0316 27.5453 7.9082 0.1422 19.9418 43.1602 26.8042 3.7522 1.1530 4.0285 6.4480
temp: 298.150 k
press: 1.00000 atm
elementType: 8 7 7 6 6 6 6 6 6 6 6 6 6 6 6 6 6 6 1 1 1 1 1 1 1 1 1 1 1 1 1 1
symmnumber: 1
zpe: 668738.7 jmol-1
zpe.correction: 0.254709 hartree
zpe.thermalcorrener: 0.269797 hartree
zpe.thermalcorrenthalpy: 0.270741 hartree
zpe.thermalcorrgfe: 0.211279 hartree
zpe.sumelectzpe: -763.470088 hartree
zpe.sumelectthermal: -763.455000 hartree
zpe.sumelectthermalent: -763.454056 hartree
zpe.sumelectthermalfe: -763.513517 hartree
dipole: -2.1760 6.2728 -0.2540
dipole: 6.6443
quadrupole: -84.3638 -107.7824 -110.5338
quadrupole: -15.7493 1.8884 -2.8961
quadrupole: 16.5295 -6.8891 -9.6404 -15.7493 1.8884 -2.8961
hfenergy: -763.7247968 hartree
pointgroup: C01 [X(C15H14N2O1)]
dipole: -0.8385235 2.4752371 -0.0589853 debye
polarizability: 296.3265836|13.664831|199.5519939|6.1596089|-12.1801843|84.9822824 unknown
InChI: InChI=1S/C15H14N2O/c1-2-16-9-8-15(18)17-11-13(10-14(16)17)12-6-4-3-5-7-12/h3-11H,2H2,1H3
charge 0 multiplicity 1
32 atoms
O  -2.140581 -3.207218 0.010719
N  -1.287167 -1.018766 -0.090153
N  -2.729126 0.914222 -0.2827
C  -1.436081 0.38562 -0.19259
C  0.795153 -0.112449 -0.068999
C  -0.165981 0.967596 -0.18152
C  0.072777 -1.318003 -0.014601
C  -2.904322 2.386781 -0.313835
C  -2.380447 -1.968178 -0.079175
C  -3.811574 0.054424 -0.270692
C  2.26388 0.028157 -0.023226
C  -3.677316 -1.322466 -0.179338
C  -2.820994 3.030448 1.085584
C  3.09209 -1.048001 0.40489
C  2.895939 1.243974 -0.406971
C  4.494835 -0.915719 0.441567
C  4.299597 1.380269 -0.364287
C  5.108958 0.30063 0.058785
H  0.057493 2.031901 -0.213153
H  0.388925 -2.355652 0.040133
H  -2.131911 2.807399 -0.982927
H  -3.885023 2.595077 -0.776772
H  -4.793402 0.530656 -0.34237
H  -4.558924 -1.964247 -0.183115
H  -3.616911 2.644161 1.745911
H  -1.847846 2.823676 1.56231
H  -2.940358 4.125788 1.003895
H  2.632051 -1.989303 0.72595
H  2.286388 2.083652 -0.75967
H  5.110319 -1.758567 0.775867
H  4.762955 2.326028 -0.667755
H  6.199102 0.404608 0.090435
