program: Gaussian 09
title: 000159491
version: EM64L-G09RevD.01
frameworkgroup: C1[X(C13H16N6OS)]
method: RPBEPBE
basis: SDD
operation: Freq
keyword: #p
keyword: freq=noraman
keyword: PBEPBE/SDD
title: #p freq=noraman PBEPBE/SDD
converged: YES YES NO NO
title: Mulliken charges:
elementType: S O N N N N N N C C C C C C C C C C C C C H H H H H H H H H H H H H H H H
charge: 0.287865 -0.169106 0.082408 -0.271263 0.110791 0.023905 0.002518 -0.348478 0.057941 -0.447454 -0.453124 -0.404187 -0.402727 -0.383676 -0.440081 -0.462663 -0.107421 -0.144633 0.229228 -0.118357 -0.106779 0.187805 0.193604 0.205115 0.199201 0.194949 0.202455 0.191293 0.193455 0.201227 0.202624 0.190437 0.227463 0.208522 0.234242 0.263392 0.369509
chargesum: 0.00000
title: Mulliken charges with hydrogens summed into heavy atoms:
elementType: S O N N N N N N C C C C C C C C C C C C C
charge: 0.287865 -0.169106 0.082408 -0.271263 0.110791 0.023905 0.002518 0.021031 0.245746 -0.048734 -0.058974 -0.010438 -0.008046 0.009385 -0.004095 0.034971 -0.107421 -0.144633 0.229228 -0.118357 -0.106779
polarizability: 3.16002500e+02 -2.85394410e+00 1.90377850e+02 -1.96688910e+01 8.39239030e-01 1.16892746e+02
1716.lowfreq: -34.7500 -8.0708 -3.3324 0.0005 0.0006 0.0011 7.4931 14.1423 31.1567
frequency: -30.7663 13.4048 31.0116 63.9660 84.5607 119.4046 121.3179 157.7459 170.4349 189.5447 211.8173 216.5158 295.4801 311.6064 319.3903 345.2924 359.9360 363.0162 392.3969 411.0277 432.4878 435.7447 463.2588 529.1337 539.3491 560.3601 574.8275 613.2021 623.1989 634.3595 673.4827 715.3916 720.9921 742.0469 763.7560 778.8403 780.8062 786.7053 831.4460 839.6143 866.7466 888.0081 909.2697 921.5438 945.2759 955.7158 982.6318 1018.7423 1050.5668 1052.6956 1064.2778 1078.2394 1089.7612 1091.1348 1109.7113 1111.7792 1125.1439 1141.8274 1167.5178 1188.6551 1190.9315 1215.0628 1242.7416 1255.7760 1261.3444 1268.4546 1282.6672 1297.5439 1303.4045 1314.8118 1331.5667 1335.2545 1338.1389 1340.1040 1348.1650 1361.8551 1401.6522 1430.7216 1445.5354 1456.2994 1460.4496 1461.9552 1465.8248 1468.9506 1476.0413 1481.1010 1549.3932 1552.8945 1682.7086 2930.5001 2953.8233 2958.3912 2965.2561 2965.6486 2967.4663 2967.8228 2985.1937 3015.0467 3020.5125 3028.9085 3029.4073 3030.1719 3042.3894 3077.1771 3615.9916
redmass: 3.4245 5.3174 6.8470 3.4438 4.6561 6.9723 6.1890 8.6424 2.7554 3.3712 1.8311 5.5235 4.8697 3.3900 2.8354 5.1454 9.8258 9.8556 3.3330 4.9904 2.6448 2.8368 3.8395 2.1879 10.8530 7.4637 6.0242 12.0593 5.1427 10.7302 11.1030 1.1644 9.0495 4.8295 1.9758 1.4645 11.2295 1.9093 8.0677 1.9938 1.9244 1.5439 1.9576 12.0055 6.7279 2.1960 1.8775 3.4959 1.8951 1.2012 2.5511 2.9993 2.1897 2.8254 4.4364 2.6069 5.2212 2.7870 2.3652 2.3771 2.1060 3.6935 1.2739 1.2820 1.3015 1.2084 1.1848 8.3349 1.3861 1.2418 1.4214 1.4132 1.5169 1.5476 1.4223 1.4915 1.8045 4.6862 1.0821 1.0914 1.0882 1.0892 1.0893 1.0845 1.0954 5.5525 12.1785 10.2804 12.7337 1.0814 1.0611 1.0619 1.0629 1.0645 1.0608 1.0622 1.0652 1.0984 1.0988 1.0988 1.0947 1.1017 1.1035 1.0965 1.0838
irintensity: 0.0243 0.0793 0.4632 0.4828 1.9330 0.9987 0.2824 1.1615 0.1540 1.7297 0.0753 0.4696 1.6294 1.6253 1.4017 1.4156 0.4396 4.4376 5.3128 3.3831 0.4024 2.9333 2.3567 0.2476 5.4878 10.2617 23.7483 0.4189 4.3874 0.9258 5.1278 119.6417 0.7174 16.1255 12.0749 1.5507 1.3471 1.0093 23.9028 8.1621 1.9464 15.3120 0.7414 9.5374 12.0537 8.1354 13.7714 3.8395 0.5353 2.0267 14.3170 50.5555 15.6006 39.7531 10.1557 0.7215 3.2000 29.1797 30.7459 21.3871 13.8109 31.7602 1.8180 1.5278 10.6559 5.1789 0.6716 12.2990 7.2149 1.1450 1.8094 0.2839 5.4225 0.6646 1.8476 2.4910 6.9846 1.1901 4.5568 1.0330 2.6625 10.6517 8.4144 29.9634 4.2490 17.4803 721.0589 30.7437 315.5417 11.4148 21.5799 39.8530 35.5710 43.7907 34.0783 23.7885 14.6758 51.9375 43.7264 75.8809 27.0489 22.6052 134.2660 11.2808 191.7815
temp: 298.150 k
press: 1.00000 atm
elementType: 16 8 7 7 7 7 7 7 6 6 6 6 6 6 6 6 6 6 6 6 6 1 1 1 1 1 1 1 1 1 1 1 1 1 1 1 1
symmnumber: 1
zpe: 756944.1 jmol-1
zpe.correction: 0.288305 hartree
zpe.thermalcorrener: 0.305545 hartree
zpe.thermalcorrenthalpy: 0.306490 hartree
zpe.thermalcorrgfe: 0.241494 hartree
zpe.sumelectzpe: -1305.184568 hartree
zpe.sumelectthermal: -1305.167327 hartree
zpe.sumelectthermalent: -1305.166383 hartree
zpe.sumelectthermalfe: -1305.231378 hartree
dipole: 3.3190 -1.9056 -0.2688
dipole: 3.8366
quadrupole: -107.3185 -152.9767 -128.1876
quadrupole: 1.8477 -4.0534 0.1445
quadrupole: 22.1758 -23.4824 1.3067 1.8477 -4.0534 0.1445
hfenergy: -1305.4728724 hartree
pointgroup: C01 [X(C13H16N6O1S1)]
dipole: 1.3045177 0.73714 -0.1823651 debye
polarizability: 316.1387715|9.8497236|181.0792459|16.4255125|-24.4920493|126.0550789 unknown
InChI: InChI=1S/C13H16N6OS/c20-12-10-11(16-18-15-10)14-13-19(12)17-9(21-13)7-6-8-4-2-1-3-5-8/h8,18H,1-7H2
charge 0 multiplicity 1
37 atoms
S  -0.433756 1.887623 -0.0902
O  -2.782322 -2.414905 0.927928
N  -0.578023 -0.664321 0.760088
N  -1.875024 -0.280804 0.374457
N  -3.168584 1.595466 -0.521553
N  -5.457886 -1.179859 -0.015318
N  -5.548974 1.044008 -0.79619
N  -6.192439 -0.139877 -0.515073
C  4.167994 0.380973 0.017424
C  4.622262 -1.028442 0.482845
C  5.010826 0.837334 -1.203113
C  6.141883 -1.08232 0.77341
C  6.529756 0.789093 -0.913272
C  6.968457 -0.619554 -0.449018
C  2.657414 0.439404 -0.322818
C  1.73913 0.216132 0.911152
C  0.279544 0.320124 0.591558
C  -2.045493 1.046372 -0.113639
C  -2.967061 -1.259881 0.496873
C  -4.200569 -0.623606 0.038652
C  -4.253419 0.736852 -0.438785
H  4.364265 1.095701 0.848925
H  4.37517 -1.761617 -0.314429
H  4.063831 -1.34011 1.387139
H  4.713059 1.862373 -1.502305
H  4.782401 0.174198 -2.064537
H  6.432398 -2.109351 1.067694
H  6.371817 -0.425405 1.638174
H  6.774894 1.526816 -0.121048
H  7.096285 1.089835 -1.815783
H  8.048462 -0.62435 -0.205463
H  6.82297 -1.339426 -1.281061
H  2.419442 -0.321158 -1.093005
H  2.429426 1.428174 -0.77146
H  1.999683 0.956124 1.694339
H  1.899056 -0.788781 1.33892
H  -7.193775 -0.237137 -0.676505
