program: Gaussian 09
title: 000013999
version: EM64L-G09RevD.01
frameworkgroup: C1[X(C21H22ClN3O2)]
method: RPBEPBE
basis: SDD
operation: Freq
keyword: #p
keyword: freq=noraman
keyword: PBEPBE/SDD
title: #p freq=noraman PBEPBE/SDD
converged: YES YES NO NO
title: Mulliken charges:
elementType: Cl O O N N N C C C C C C C C C C C C C C C C C C C C C H H H H H H H H H H H H H H H H H H H H H H
charge: -0.044004 -0.246971 -0.234713 -0.094800 -0.232373 -0.032993 -0.350040 -0.340043 -0.353139 -0.401613 -0.317197 -0.313957 0.303352 0.209357 0.165712 -0.613153 -0.019124 -0.353833 -0.330094 0.317509 -0.234202 -0.142834 -0.368297 -0.378926 -0.236177 -0.228836 -0.237248 0.192767 0.259124 0.199497 0.198989 0.222417 0.193643 0.259004 0.222103 0.191650 0.213929 0.215470 0.193580 0.237412 0.270989 0.254718 0.298145 0.262743 0.253374 0.275267 0.230406 0.230843 0.232567
chargesum: 0.00000
title: Mulliken charges with hydrogens summed into heavy atoms:
elementType: Cl O O N N N C C C C C C C C C C C C C C C C C C C C C
charge: -0.044004 -0.246971 -0.234713 -0.094800 -0.232373 -0.032993 0.101851 0.058443 0.062921 0.079494 0.088382 0.095093 0.303352 0.209357 0.165712 -0.104752 -0.019124 -0.099114 -0.031949 0.317509 0.028541 -0.142834 -0.114924 -0.103659 -0.005771 0.002007 -0.004681
polarizability: 2.80390598e+02 -1.19989794e+01 2.79160803e+02 -4.56852108e+01 -1.57003063e+01 2.48637549e+02
1716.lowfreq: -15.4818 -5.1587 -0.0016 -0.0005 0.0005 1.6308 5.1308 17.0471 23.4510
frequency: -12.9438 16.9873 23.1699 48.0474 53.1068 58.9358 74.3725 83.7075 99.0387 116.2683 127.2916 169.7781 199.8303 206.2440 234.5513 237.4536 259.3248 279.5963 286.6477 316.4205 322.0247 329.1233 361.3476 375.5712 388.9952 402.4917 405.7621 428.3935 438.0444 454.6606 469.2069 482.0765 493.5238 516.2090 542.1375 571.8806 593.2942 615.3235 643.8999 652.3994 673.2510 690.2778 701.0103 721.5957 753.1950 762.8703 779.9625 786.9995 787.5466 808.5575 823.0149 839.8945 859.9362 892.4048 900.0591 917.1988 928.5357 940.3435 951.9077 970.2994 984.8255 988.2665 989.8571 997.7022 1003.5462 1026.0880 1027.4224 1041.1225 1051.5286 1058.1559 1067.0827 1084.4569 1087.9044 1090.7438 1104.8276 1130.0940 1138.3569 1151.9955 1161.7177 1173.6369 1189.0096 1190.0108 1191.4497 1216.4273 1247.3506 1260.5726 1272.2167 1276.9814 1294.6849 1295.0259 1296.6765 1311.0335 1314.5751 1318.9236 1334.4567 1339.3628 1349.6241 1361.9752 1370.3637 1370.8833 1382.3687 1388.1437 1389.7241 1434.4833 1441.6550 1445.1396 1447.8143 1450.3552 1457.9062 1462.6469 1464.6060 1481.3233 1481.6790 1540.3635 1566.7809 1587.1935 1591.3330 1609.4257 1614.4477 2865.1142 2873.8413 2889.7518 2945.1735 2954.4267 2959.8875 3021.9237 3037.4966 3043.7117 3061.0038 3080.1860 3085.2146 3109.5417 3115.2368 3127.5141 3136.4495 3148.5871 3151.0194 3160.5805 3168.5431 3171.0971 3175.5783
redmass: 2.9884 5.7054 7.1367 5.0371 3.9514 5.5229 5.3020 6.4157 3.8816 7.4502 5.5085 5.5484 5.2871 3.7997 2.4556 3.2604 3.4343 5.4621 4.1204 3.1129 4.4362 5.8597 3.4223 4.2595 2.3137 3.5208 2.8699 4.5773 5.6669 5.0366 2.7904 6.1606 3.4439 4.6247 3.7168 4.8082 2.1284 6.4113 5.2420 4.6300 6.7238 5.2027 1.8523 3.6865 3.8016 2.0390 2.4118 3.4722 2.5779 3.4191 1.4993 1.5981 1.2489 2.4800 1.5343 2.6148 3.9257 1.4768 1.3388 3.7326 4.1938 1.3977 5.8984 2.7604 1.3369 2.2579 2.2048 3.8021 2.2280 2.5293 2.6928 1.6423 2.9125 2.2496 2.3280 2.3071 2.4540 1.9734 1.8102 1.0592 1.1821 1.1669 1.2865 1.3263 1.8022 1.9655 1.3929 1.5969 2.1927 1.3476 1.6876 1.3236 1.3204 1.3496 1.2335 1.7099 1.3669 1.4385 2.9946 1.7683 7.7594 2.6405 1.6412 2.2648 1.0828 1.1128 1.0838 1.1057 1.1118 1.2470 1.9465 2.3617 1.0936 7.2964 7.9997 6.5646 6.9674 6.1773 8.3639 1.0701 1.0696 1.0701 1.0682 1.0663 1.0664 1.0892 1.0908 1.0590 1.0890 1.0966 1.0979 1.0936 1.1057 1.0849 1.0883 1.0933 1.0887 1.0963 1.0923 1.0998 1.0969
irintensity: 0.0235 0.0626 0.1616 0.4513 0.2473 0.7953 1.7454 1.5688 2.4820 1.9262 0.6888 0.6658 0.3082 5.9282 2.0445 0.2093 0.5209 1.8227 5.4807 12.4780 2.9377 2.4872 6.8153 9.0064 0.8537 2.3079 0.0149 8.2960 2.7233 6.8078 1.0049 3.7165 6.1036 11.4416 17.0503 12.2460 15.9612 0.0085 0.9893 11.7098 0.9671 3.8920 43.4822 28.6726 5.6233 18.8022 16.4207 59.1832 7.6606 30.8926 24.6751 0.1747 2.5759 7.3217 11.8292 17.3996 10.9861 4.0920 0.9115 3.2089 12.1650 2.2321 1.5107 28.0732 1.2910 5.9773 9.3566 14.4658 27.3932 11.3954 6.3654 6.4077 58.7989 2.1686 2.3256 15.4206 90.8612 29.1354 18.6869 0.3684 16.6578 4.5287 17.7180 31.4198 42.7523 51.9683 11.3493 24.8258 31.9285 24.1943 36.4751 8.8935 1.1171 8.5404 2.2775 20.7127 6.5736 5.6677 10.9159 5.0593 2.8549 30.7386 19.6715 13.8225 2.6254 15.8697 4.0661 15.3282 15.8144 61.9810 94.4350 4.0383 10.3394 34.1349 12.2944 2.6533 31.1909 19.0668 333.9922 43.2427 62.3656 110.0314 32.5345 38.7178 96.0615 46.0840 27.1467 20.7564 6.4311 35.9191 36.6295 12.6817 10.3745 1.2424 5.2885 28.6408 4.9337 17.0539 0.2491 19.0893 2.8820
temp: 298.150 k
press: 1.00000 atm
elementType: 17 8 8 7 7 7 6 6 6 6 6 6 6 6 6 6 6 6 6 6 6 6 6 6 6 6 6 1 1 1 1 1 1 1 1 1 1 1 1 1 1 1 1 1 1 1 1 1 1
symmnumber: 1
zpe: 1026074.1 jmol-1
zpe.correction: 0.390811 hartree
zpe.thermalcorrener: 0.413616 hartree
zpe.thermalcorrenthalpy: 0.414560 hartree
zpe.thermalcorrgfe: 0.337020 hartree
zpe.sumelectzpe: -1586.209078 hartree
zpe.sumelectthermal: -1586.186273 hartree
zpe.sumelectthermalent: -1586.185329 hartree
zpe.sumelectthermalfe: -1586.262869 hartree
dipole: 1.5037 1.8141 -1.6337
dipole: 2.8672
quadrupole: -178.9439 -156.7646 -173.2408
quadrupole: -11.8303 -4.0391 7.6637
quadrupole: -9.2942 12.8852 -3.5910 -11.8303 -4.0391 7.6637
hfenergy: -1586.5998889 hartree
pointgroup: C01 [X(C21H22Cl1N3O2)]
dipole: 0.3251531 1.0778649 -0.0707619 debye
polarizability: 281.9929094|13.7715233|292.1202273|-40.6050761|-1.2105196|234.0758135 unknown
InChI: InChI=1S/C21H22ClN3O2/c22-17-6-7-19-18(14-17)21(16-4-2-1-3-5-16)23-15-20(26)25(19)9-8-24-10-12-27-13-11-24/h1-7,14H,8-13,15H2
charge 0 multiplicity 1
49 atoms
Cl 2.587579 4.791215 1.398855
O  -6.016738 -0.530341 -2.297014
O  -0.942629 -2.572207 2.282492
N  -3.716165 -0.820813 -0.553512
N  -0.656644 -0.343983 1.65273
N  2.075493 -1.55738 1.159659
C  -2.312219 -0.978951 -0.120693
C  -3.974032 0.447082 -1.280913
C  -4.250889 -1.977861 -1.31628
C  -2.094506 -0.299746 1.255707
C  -5.482804 0.609034 -1.534118
C  -5.755966 -1.782325 -1.563933
C  0.150144 0.840659 1.592753
C  1.461075 0.84229 1.01337
C  -0.179674 -1.577068 2.14127
C  1.326454 -1.620129 2.435924
C  2.113548 -0.409301 0.508834
C  -0.387839 2.05861 2.093865
C  2.189354 2.06432 0.963407
C  2.886293 -0.370957 -0.772408
C  0.336996 3.261822 2.035216
C  1.627759 3.244585 1.46733
C  2.596998 0.576305 -1.792261
C  3.90519 -1.336051 -1.001013
C  3.314364 0.561551 -3.008653
C  4.623379 -1.345665 -2.212706
C  4.332445 -0.395499 -3.221975
H  -1.588979 -0.558624 -0.86126
H  -2.086236 -2.053451 -0.010239
H  -3.433564 0.467998 -2.260994
H  -3.612582 1.302454 -0.678479
H  -4.091951 -2.899886 -0.727048
H  -3.733817 -2.10038 -2.300562
H  -2.696602 -0.832636 2.009674
H  -2.422272 0.750435 1.211809
H  -6.014134 0.691693 -0.561264
H  -5.691136 1.499733 -2.149895
H  -6.164165 -2.585728 -2.198899
H  -6.29156 -1.763143 -0.590381
H  1.592621 -0.788937 3.125138
H  1.538079 -2.582785 2.922698
H  -1.375757 2.056403 2.564651
H  3.194081 2.072037 0.532093
H  -0.084057 4.187665 2.437086
H  1.799314 1.312266 -1.644924
H  4.106725 -2.070846 -0.215668
H  3.076124 1.292405 -3.789254
H  5.410567 -2.090541 -2.37347
H  4.892141 -0.40303 -4.163943
