program: Gaussian 09
title: 000155058
version: EM64L-G09RevD.01
frameworkgroup: C1[X(C9H10O3)]
method: RPBEPBE
basis: SDD
operation: Freq
keyword: #pfreq=noraman
keyword: PBEPBE/SDD
title: #p freq=noraman PBEPBE/SDD
converged: YES YES NO NO
title: Mulliken charges:
elementType: O O O C C C C C C C C C H H H H H H H H H H
charge: -0.441065 -0.287778 -0.255463 0.378883 0.247076 -0.534620 -0.350903 -0.438835 -0.342438 -0.202482 0.176060 -0.501086 0.275118 0.271020 0.205369 0.237121 0.273804 0.232710 0.339194 0.243312 0.232343 0.242660
chargesum: 0.00000
title: Mulliken charges with hydrogens summed into heavy atoms:
elementType: O O O C C C C C C C C C
charge: -0.101872 -0.287778 -0.255463 0.378883 0.247076 -0.259503 -0.079882 0.003656 -0.068633 0.030228 0.176060 0.217228
polarizability: 1.55150897e+02 2.66803861e+00 1.10919854e+02 -2.51650836e+00 2.51816217e+00 5.68077409e+01
1716.lowfreq: -9.0405 -4.4035 0.0003 0.0006 0.0008 8.4649 39.1510 53.4768 91.4470
frequency: 39.1477 53.4744 91.4444 115.9628 123.1577 166.9263 205.3052 240.3329 282.9353 319.4893 356.5434 403.9374 426.7695 482.6896 499.3716 597.9183 657.9905 691.1699 724.2311 749.7730 818.5380 833.0803 917.5674 940.0301 954.0750 968.1179 988.1901 994.1139 1001.6064 1086.1086 1089.6923 1114.4983 1148.6701 1159.3276 1173.9367 1183.1000 1268.0705 1288.6364 1315.2473 1362.2838 1394.5475 1422.7631 1436.9428 1451.8741 1463.8135 1464.0165 1475.1612 1588.0385 1614.3167 1625.9909 2966.6522 3003.9646 3053.3486 3105.1633 3135.6902 3137.4509 3148.3078 3156.0312 3179.9052 3556.0208
redmass: 4.1115 3.9425 1.2341 2.9025 4.2268 3.3524 4.4075 3.2679 5.6231 3.8860 1.4317 3.8305 3.0406 3.8363 5.4247 5.5335 6.4592 3.6065 2.5938 5.8881 1.7446 3.9560 1.4269 5.7456 1.4418 1.9655 5.7202 2.9443 1.4137 2.8690 1.6473 1.2643 1.4950 1.1244 1.3479 1.6008 4.1922 1.3526 1.2558 1.2737 6.3620 1.2413 2.7562 1.0498 1.0666 1.2492 1.8383 6.5584 6.4627 9.2083 1.0666 1.0296 1.0962 1.1044 1.0872 1.0917 1.1047 1.0946 1.0963 1.0662
irintensity: 1.6036 4.4616 1.9360 1.7212 1.4719 0.1586 3.6973 22.1140 4.7112 4.7474 132.8283 43.2839 4.9471 23.4978 3.1226 14.5944 3.8518 3.0549 56.8021 9.4843 32.6124 14.3578 28.6300 49.4598 5.2583 25.4668 3.4187 8.1796 2.4242 112.0118 9.1910 0.0625 69.8262 12.8345 121.4042 103.8432 144.5618 4.4929 6.0888 39.5328 4.1319 25.5624 27.3600 14.3315 14.4953 2.3019 5.9178 32.0478 41.4812 130.5099 49.3069 39.3788 16.4846 26.8810 5.4527 2.0101 16.3089 10.7430 5.5748 7.6897
temp: 298.150 k
press: 1.00000 atm
elementType: 8 8 8 6 6 6 6 6 6 6 6 6 1 1 1 1 1 1 1 1 1 1
symmnumber: 1
zpe: 449876.4 jmol-1
zpe.correction: 0.171349 hartree
zpe.thermalcorrener: 0.183218 hartree
zpe.thermalcorrenthalpy: 0.184162 hartree
zpe.thermalcorrgfe: 0.132356 hartree
zpe.sumelectzpe: -573.734568 hartree
zpe.sumelectthermal: -573.722700 hartree
zpe.sumelectthermalent: -573.721755 hartree
zpe.sumelectthermalfe: -573.773561 hartree
dipole: -1.5490 1.5880 0.7279
dipole: 2.3347
quadrupole: -68.2895 -69.4624 -68.5118
quadrupole: -2.8847 1.5260 -0.0112
quadrupole: 0.4650 -0.7078 0.2428 -2.8847 1.5260 -0.0112
hfenergy: -573.9059172 hartree
pointgroup: C01 [X(C9H10O3)]
dipole: -0.600216 0.579506 0.3842471 debye
dipolederiv: -0.7645946 0.1582779 -0.244249 0.2034405 -0.5548083 -0.0622324 -0.3316305 -0.0299148 -0.3243784 -1.5549134 0.1528119 0.1001632 0.4657359 -0.558163 -0.0753645 0.161788 -0.0573495 -0.3150377 -0.7581498 -0.2160495 -0.0152025 -0.0801409 -0.9208794 -0.1048287 0.0127429 -0.093116 -0.3422091 -0.0055046 -0.1645798 -0.1072996 -0.1318459 -0.1249461 -0.002027 -0.1229723 0.0298684 -0.0720347 -0.5430328 -0.1765915 -0.0083251 -0.1847833 -0.103186 -0.0058096 0.0148054 -0.0140494 0.0031899 0.0000802 0.1678907 0.0229726 -0.0583145 -0.0184417 0.0364121 -0.0329982 0.0345211 -0.1189072 0.0229237 0.0577251 -0.0101883 0.0625175 -0.0102054 0.0174424 0.028524 -0.0132028 -0.1447427 0.5771205 -0.0382272 0.1716009 -0.0980457 0.393272 0.0293533 0.2600158 -0.0151128 0.3931317 0.0522037 -0.0569018 -0.0261473 0.1359163 -0.0204667 0.0099366 0.0163162 0.0222954 -0.1218674 -0.1950149 0.0479974 0.013974 0.0623268 0.1628234 0.056743 0.0129134 0.0629942 -0.1378956 2.0235677 0.1642079 -0.0740724 -0.2215267 1.1877312 0.1890569 -0.1496378 0.1599992 0.2732662 0.7584928 0.0001258 -0.0288263 0.071499 0.2260105 -0.0144436 -0.0179925 -0.0105251 0.2802482 0.1373757 -0.0083312 -0.0017129 0.0097755 -0.0189645 -0.0295559 -0.0045673 -0.0241878 0.1444228 -0.0205675 -0.0709067 0.0042539 -0.0623129 0.0929449 -0.0100598 0.0059123 -0.0134958 0.1499575 -0.0201447 -0.1144242 -0.0484419 -0.0281266 -0.1673402 -0.0145606 -0.0309951 0.0204822 0.0557678 -0.0450798 0.0510871 0.0707531 -0.0023466 0.0830306 0.0318609 0.0308305 -0.0010059 -0.0894882 0.0431409 0.0758527 0.0216352 0.0791552 0.0678355 -0.0220685 0.0234509 -0.0241804 0.1531452 0.0680731 -0.0236232 -0.0006697 -0.031903 -0.1115094 -0.0463513 -0.0087994 -0.0479228 0.1445448 0.299216 -0.0791367 0.1423461 -0.1347594 0.3443505 0.00514 0.1361111 0.0100291 0.0597567 -0.0252866 -0.0017094 0.0043187 -0.0925233 0.0718069 -0.0735498 -0.0667369 -0.0601074 -0.0801763 -0.0281432 0.064421 0.0201269 0.1328626 -0.03024 -0.0341986 0.0326717 -0.0301876 0.1140268 -0.0217623 0.0100838 -0.0070093 -0.0966006 0.0093453 0.1191051 0.0302475 0.0941684 -0.0247202 unknown
polarizability: 155.1133516|2.8469706|108.9554311|-3.3771711|10.3120871|58.8097091 unknown
InChI: InChI=1S/C9H10O3/c1-12-9(11)8-4-2-3-7(5-8)6-10/h2-5,10H,6H2,1H3
charge 0 multiplicity 1
22 atoms
O  4.202264 -0.749681 0.37417
O  -2.969578 0.411925 0.230408
O  -2.187127 -1.738385 -0.206051
C  1.831777 -0.199597 -0.193415
C  -0.598935 0.105662 0.021764
C  0.52397 -0.731341 -0.205249
C  2.010025 1.185789 0.063283
C  3.037483 -1.092236 -0.45862
C  -0.412627 1.488744 0.272568
C  0.894467 2.021221 0.293988
C  -1.952316 -0.520864 -0.002747
C  -4.345605 -0.135249 0.221243
H  0.347651 -1.797986 -0.389022
H  3.027097 1.592808 0.081712
H  2.755541 -2.159061 -0.337225
H  3.410116 -0.955838 -1.489222
H  -1.285009 2.123416 0.449748
H  1.044357 3.08856 0.489505
H  3.944757 -0.824733 1.32828
H  -4.568933 -0.592785 -0.757235
H  -4.993661 0.731644 0.411697
H  -4.458915 -0.898413 1.009619
