program: Gaussian 09
title: 000155037
version: EM64L-G09RevD.01
frameworkgroup: C1[X(C8H12O6P2)]
method: RPBEPBE
basis: SDD
operation: Freq
keyword: #p
keyword: freq=noraman
keyword: PBEPBE/SDD
title: #p freq=noraman PBEPBE/SDD
converged: YES YES NO NO
title: Mulliken charges:
elementType: P P O O O O O O C C C C C C C C H H H H H H H H H H H H
charge: 1.242813 1.242812 -0.673764 -0.675130 -0.673764 -0.675130 -0.618578 -0.618577 0.453723 0.453724 -0.916648 -0.916649 -0.344726 -0.351212 -0.351215 -0.344731 0.298878 0.302382 0.298879 0.302382 0.252139 0.241168 0.241169 0.252138 0.395843 0.393115 0.395843 0.393115
chargesum: 0.00000
title: Mulliken charges with hydrogens summed into heavy atoms:
elementType: P P O O O O O O C C C C C C C C
charge: 1.242813 1.242812 -0.277921 -0.282015 -0.277921 -0.282015 -0.618578 -0.618577 0.453723 0.453724 -0.315388 -0.315387 -0.092587 -0.110044 -0.110046 -0.092593
polarizability: 2.06210788e+02 1.34120759e-04 1.14772045e+02 1.63535369e+00 -4.23052608e-04 1.34124063e+02
1716.lowfreq: -0.0017 0.0013 0.0021 3.0854 4.5699 14.3947 26.0135 27.1076 28.1005
frequency: 25.9849 26.7529 28.0954 43.1394 45.8269 79.8347 116.3470 121.3007 141.4601 185.0173 207.8033 222.7054 246.5472 283.1467 294.0753 298.4381 303.0459 328.2215 330.0753 349.1591 351.4970 361.0729 372.8963 405.1380 419.2224 469.5205 564.6351 622.3082 633.7612 638.9967 690.7704 711.6558 715.1493 719.8104 755.0919 780.6307 831.6613 844.5687 853.0680 876.2557 891.7092 960.8000 973.8057 982.4626 983.0732 1000.9775 1001.9124 1016.8147 1065.1055 1070.7094 1117.1836 1160.1448 1165.1156 1200.2265 1219.6482 1220.0019 1264.7787 1265.9181 1324.6729 1387.4877 1416.0942 1421.9082 1422.2939 1510.1657 1587.1138 1625.3369 3039.7145 3039.8555 3111.2024 3111.2903 3132.0218 3133.1828 3153.2244 3158.6361 3591.0134 3591.2358 3599.0906 3599.1725
redmass: 8.1632 7.1733 8.9132 4.0862 4.7477 6.6158 3.2713 2.6423 7.2576 7.6675 4.5078 3.0869 2.1495 4.9270 5.9592 2.0292 3.8571 1.3349 1.3013 3.1937 2.4921 2.9618 2.0745 2.7998 6.2442 3.9537 4.8973 7.1072 5.0576 5.2389 6.2187 5.2547 7.8233 7.3970 3.7756 4.3281 4.0462 1.2623 1.8637 1.7790 1.7948 1.3586 1.3997 1.8504 1.8048 1.2237 1.2117 2.9112 2.0350 2.2135 1.5374 1.1626 1.1407 1.1189 1.7947 3.5388 1.4025 1.4635 1.2509 6.6864 2.6237 1.1148 1.1060 2.6569 6.6867 6.3686 1.0590 1.0590 1.1046 1.1045 1.0882 1.0888 1.0964 1.0978 1.0661 1.0662 1.0663 1.0663
irintensity: 0.4970 2.9116 0.1648 0.1801 0.4347 0.1322 47.3596 7.3140 0.4305 0.1341 9.4415 57.3473 4.3398 155.1052 19.0138 20.4311 21.0147 92.3457 151.8590 9.8745 240.2837 1.6712 0.0021 0.1128 26.0867 30.0937 9.8625 38.2482 24.6462 19.6114 251.8710 15.1157 452.8763 18.5761 47.1529 26.9574 9.2426 2.0269 32.7719 13.8199 10.6554 1.0285 0.2536 0.8241 1.3631 30.1899 47.0744 6.1266 109.7028 110.8467 88.6949 8.8287 17.1252 0.2547 1.4136 0.8970 6.0594 2.4979 0.0497 0.1065 9.9788 15.2558 14.3281 27.7128 0.0001 1.0608 7.4763 0.4198 0.0012 0.1296 0.0256 18.5179 13.5371 0.2023 49.8014 60.1058 95.5863 12.3952
temp: 298.150 k
press: 1.00000 atm
elementType: 15 15 8 8 8 8 8 8 6 6 6 6 6 6 6 6 1 1 1 1 1 1 1 1 1 1 1 1
symmnumber: 1
zpe: 519237.8 jmol-1
zpe.correction: 0.197767 hartree
zpe.thermalcorrener: 0.216706 hartree
zpe.thermalcorrenthalpy: 0.217650 hartree
zpe.thermalcorrgfe: 0.148057 hartree
zpe.sumelectzpe: -1444.632773 hartree
zpe.sumelectthermal: -1444.613834 hartree
zpe.sumelectthermalent: -1444.612890 hartree
zpe.sumelectthermalfe: -1444.682483 hartree
dipole: -0.0001 -1.0118 0.0000
dipole: 1.0118
quadrupole: -97.8054 -105.3350 -113.7882
quadrupole: -0.0003 -4.1001 0.0000
quadrupole: 7.8374 0.3079 -8.1453 -0.0003 -4.1001 0.0000
hfenergy: -1444.8305401 hartree
pointgroup: C01 [X(C8H12O6P2)]
dipole: 0.0000498 0.3980685 -0.0000265 debye
polarizability: 206.2258796|-0.0034942|114.7720454|-1.2594689|0.0013038|134.1089717 unknown
InChI: InChI=1S/C8H12O6P2/c9-15(10,11)5-7-1-2-8(4-3-7)6-16(12,13)14/h1-4,9-10,12-13H,5-6H2
charge 0 multiplicity 1
28 atoms
P  -3.627327 -0.732787 0.099112
P  3.627294 -0.733084 -0.099043
O  -3.214091 -1.301239 -1.493571
O  -5.306378 -0.33241 -0.037396
O  3.214099 -1.301286 1.493741
O  5.306384 -0.332822 0.037319
O  -3.243225 -1.766009 1.25092
O  3.243044 -1.766433 -1.250689
C  -1.424351 1.025005 0.052815
C  1.424457 1.024887 -0.052941
C  -2.936117 1.007457 0.108678
C  2.936222 1.007213 -0.108805
C  -0.750327 1.021037 -1.194442
C  0.658648 1.022509 -1.246021
C  -0.658542 1.022726 1.245896
C  0.750433 1.021137 1.194316
H  -3.328826 1.475254 1.026692
H  -3.397895 1.504555 -0.759876
H  3.328966 1.474876 -1.026872
H  3.39804 1.504373 0.759693
H  -1.331329 1.003033 -2.122925
H  1.165934 1.010116 -2.217468
H  -1.165829 1.010503 2.217343
H  1.331433 1.003213 2.122802
H  -2.802716 -2.203137 -1.494154
H  -5.931818 -1.094229 0.059735
H  2.80266 -2.203155 1.494468
H  5.93176 -1.094704 -0.059729
