program: Gaussian 09
title: 000159160
version: EM64L-G09RevD.01
frameworkgroup: C1[X(C8H10O2)]
method: RPBEPBE
basis: SDD
operation: Freq
keyword: #pfreq=noraman
keyword: PBEPBE/SDD
title: #p freq=noraman PBEPBE/SDD
converged: YES YES NO NO
title: Mulliken charges:
elementType: O O C C C C C C C C H H H H H H H H H H
charge: -0.429385 -0.440931 -0.200497 -0.160226 -0.352116 -0.243498 0.407673 -0.332753 -0.176576 -0.564076 0.225989 0.233018 0.241427 0.237994 0.225520 0.337276 0.343139 0.210868 0.217856 0.219299
chargesum: 0.00000
title: Mulliken charges with hydrogens summed into heavy atoms:
elementType: O O C C C C C C C C
charge: -0.092110 -0.097792 0.025491 0.072792 -0.110689 -0.005504 0.407673 -0.107233 0.034293 -0.126922
polarizability: 1.31142876e+02 -1.16303252e+00 8.52633215e+01 5.78149374e+00 1.14382025e+01 6.59361448e+01
1716.lowfreq: -10.6180 -6.1992 0.0003 0.0007 0.0007 9.1325 48.1138 83.2888 121.4538
frequency: 48.0985 83.2493 121.4390 189.2838 221.5780 265.2369 287.5267 315.7731 331.5351 398.3710 451.2055 471.7935 521.3536 568.7763 629.5488 690.4689 730.9902 794.8260 838.5187 854.8623 909.3067 938.7834 953.0005 968.9294 975.1344 977.5171 998.5623 1045.6991 1127.9601 1154.2746 1176.6178 1190.5944 1200.1871 1276.4551 1298.9555 1307.7793 1330.0276 1340.8825 1381.3518 1402.2981 1434.9911 1599.7418 1637.2727 1659.8974 2948.0822 3039.8458 3085.7621 3101.9723 3113.3276 3145.5261 3153.7846 3205.3178 3528.3751 3544.3065
redmass: 4.0418 3.0086 3.1889 3.3948 3.1866 1.1252 2.0716 1.6685 2.5150 4.2184 2.9620 3.3798 3.3066 3.6239 3.6955 1.8535 3.4609 1.7264 2.8965 1.7429 4.5351 1.3709 5.1696 3.4570 1.9980 1.4181 1.1521 1.6760 1.3628 1.5995 1.2755 1.1367 1.3510 1.6585 1.4392 1.2619 1.3211 1.2470 1.7026 1.6749 1.3224 7.6390 4.7696 6.0216 1.0825 1.0854 1.0796 1.0715 1.0869 1.0916 1.0979 1.1145 1.0662 1.0664
irintensity: 1.0817 3.0280 0.9421 2.8424 5.3699 101.8053 7.4068 135.5425 11.7467 9.2707 8.0998 2.4621 4.3446 3.6119 21.1868 5.7304 5.5904 17.4573 44.4808 8.6343 95.3992 70.9231 36.1698 47.4299 14.4241 0.8326 20.5613 11.0785 18.7848 34.4658 11.7403 41.9366 8.3978 4.8739 0.8121 1.4281 5.1158 34.8634 12.3482 5.7127 19.1873 0.8042 3.4687 1.7040 25.7343 28.2306 18.5511 4.8489 12.0057 13.9238 16.3442 21.1834 3.3513 8.4214
temp: 298.150 k
press: 1.00000 atm
elementType: 8 8 6 6 6 6 6 6 6 6 1 1 1 1 1 1 1 1 1 1
symmnumber: 1
zpe: 418495.3 jmol-1
zpe.correction: 0.159396 hartree
zpe.thermalcorrener: 0.169611 hartree
zpe.thermalcorrenthalpy: 0.170556 hartree
zpe.thermalcorrgfe: 0.123729 hartree
zpe.sumelectzpe: -460.468850 hartree
zpe.sumelectthermal: -460.458635 hartree
zpe.sumelectthermalent: -460.457691 hartree
zpe.sumelectthermalfe: -460.504518 hartree
dipole: 0.7160 -0.7090 0.5425
dipole: 1.1444
quadrupole: -55.7040 -56.7296 -62.1119
quadrupole: -4.8709 3.8912 5.7974
quadrupole: 2.4778 1.4522 -3.9301 -4.8709 3.8912 5.7974
hfenergy: -460.6282462 hartree
pointgroup: C01 [X(C8H10O2)]
dipole: 0.2780437 0.2763465 -0.2214396 debye
dipolederiv: -0.2415239 -0.0570636 0.1852264 -0.0935214 -0.7550151 0.1329075 0.2682695 0.2079648 -0.5255736 -0.3568107 0.2041546 -0.1405457 0.089636 -0.5370511 0.052427 -0.3137316 0.1200429 -0.6731549 0.3856913 0.2938418 -0.0715258 0.1178011 0.4250702 -0.1507687 -0.2455536 -0.2743689 0.4298015 0.3075498 -0.0410868 0.0054669 0.0964453 0.2109039 -0.141079 0.1527975 -0.2035503 0.4675087 -0.1846477 -0.049975 0.0427349 0.0501841 -0.0279906 0.0885321 0.0076208 0.0204224 -0.218674 -0.0480341 0.0638101 0.0267885 -0.0415295 -0.0882241 0.1305075 0.0244817 0.1407612 -0.1901673 0.2704254 -0.148016 -0.0717763 -0.1734069 -0.003989 -0.0394663 -0.1094085 -0.0246703 -0.0074431 -0.073242 0.057918 0.0005979 -0.0639425 0.1986759 0.1293811 0.0006525 0.175664 -0.1025165 0.2137637 0.0602933 -0.0096619 0.2232974 -0.0145783 0.1104423 0.1148351 0.1512013 -0.009162 -0.1547344 0.0592977 0.074467 0.0820603 -0.1874541 0.2082949 0.1212017 0.1837183 -0.1968336 -0.0309629 -0.0770535 -0.0519936 -0.0594886 -0.0224582 -0.0411952 -0.00218 -0.0133562 -0.1179237 -0.1123314 -0.0342806 0.0742883 -0.0498677 0.0443784 0.0376035 0.0434398 0.0454508 -0.0002818 -0.0121154 0.0778909 0.0231271 0.0851096 -0.003904 -0.0608436 0.0192639 -0.0673344 0.1306442 0.0240748 0.0701146 0.0381507 0.0587075 -0.0286835 -0.0989729 0.0232586 -0.1045407 0.1116626 0.015098 -0.1028436 -0.0619794 -0.0654812 -0.0150296 -0.0900909 -0.0198801 -0.0967817 0.1127638 -0.0351608 -0.1318065 -0.0692701 -0.0131479 0.3432247 0.0187255 -0.0711678 0.0378166 0.2624535 0.0779878 -0.1265912 0.0832541 -0.1071885 0.2730804 0.0295669 0.1219473 0.0015963 0.2924355 0.0181745 -0.0272418 -0.014741 -0.0747024 -0.0004062 -0.130228 -0.0712982 -0.1292347 0.0421834 -0.1220316 -0.0194585 0.0017364 -0.0235218 0.1361945 -0.0542222 -0.016041 -0.0523791 0.1371642 0.0588296 -0.071904 -0.0643444 -0.0374431 0.0532557 -0.1315216 -0.0485076 -0.1184222 0.0551132 unknown
polarizability: 130.995699|1.3832776|85.6746953|-6.5717235|11.0465235|65.6719481 unknown
InChI: InChI=1S/C8H10O2/c1-2-6-3-4-7(9)8(10)5-6/h2-5,7-10H,1H2
charge 0 multiplicity 1
20 atoms
O  -1.394052 -2.003178 0.880006
O  -2.321915 0.800925 -1.368984
C  -1.104777 -1.052155 -0.225999
C  -1.856883 0.299169 -0.041103
C  0.395991 -0.940832 -0.287902
C  -1.058667 1.373335 0.656459
C  1.069939 0.183367 0.127191
C  0.304733 1.321337 0.686533
C  2.546075 0.312439 0.098428
C  3.410287 -0.395435 -0.679197
H  -1.48878 -1.471105 -1.183292
H  -2.801101 0.097983 0.495344
H  0.938074 -1.834926 -0.615091
H  -1.607461 2.219713 1.083586
H  0.87653 2.143797 1.136118
H  -2.322798 -2.336578 0.769683
H  -1.566314 1.283453 -1.794552
H  2.963419 1.075017 0.773504
H  4.491813 -0.238304 -0.612133
H  3.064785 -1.138222 -1.4081
