program: Gaussian 09
title: 000159158
version: EM64L-G09RevD.01
frameworkgroup: C1[X(C6H11N3)]
method: RPBEPBE
basis: SDD
operation: Freq
keyword: #pfreq=noraman
keyword: PBEPBE/SDD
title: #p freq=noraman PBEPBE/SDD
converged: YES YES NO NO
title: Mulliken charges:
elementType: N N N C C C C C C H H H H H H H H H H H
charge: -0.157999 -0.114345 -0.544387 -0.476040 0.224130 -0.397905 -0.211585 -0.632749 -0.328370 0.192646 0.241039 0.209307 0.239412 0.251186 0.240404 0.237839 0.244643 0.249190 0.271578 0.262005
chargesum: 0.00000
title: Mulliken charges with hydrogens summed into heavy atoms:
elementType: N N N C C C C C C
charge: -0.157999 -0.114345 -0.010804 -0.042355 0.224130 0.050814 0.039601 0.090137 -0.079180
polarizability: 1.05833091e+02 1.25242042e+00 8.66934201e+01 7.32081137e+00 -4.81278071e-01 5.48226600e+01
1716.lowfreq: -20.3624 -5.1639 -0.0010 -0.0007 -0.0007 7.2392 52.1609 79.0703 94.3154
frequency: 51.8735 78.9659 94.2900 105.1347 201.1445 265.6777 287.8888 318.2623 358.0801 411.2995 563.0465 621.9347 649.7728 687.6408 729.3386 744.8643 771.3670 840.1336 896.0943 930.6592 980.8272 1024.3143 1052.4760 1074.3775 1097.4373 1117.1404 1150.9799 1197.0428 1261.8098 1267.5336 1271.6927 1329.6468 1337.2079 1339.5768 1393.3691 1440.1962 1449.1971 1467.2502 1473.9734 1477.1719 1485.0039 1503.5690 1644.2826 2974.6211 2988.5944 2990.4054 3049.3413 3073.2632 3075.6238 3109.5539 3219.5144 3248.4013 3465.8849 3592.9877
redmass: 2.4486 1.1877 1.7459 4.1527 3.3079 1.2628 1.9107 2.7691 4.4208 2.5791 1.4634 3.2027 4.1448 5.1138 1.2940 1.3204 3.4985 1.3624 5.6938 1.3782 5.5365 1.9369 1.4754 1.2406 4.2153 1.3332 2.0305 2.7758 1.6309 1.7767 1.3504 1.2181 3.3454 1.2351 2.5304 1.4378 1.3567 1.0989 2.0762 1.0553 1.6950 2.2374 1.0904 1.0648 1.0561 1.0437 1.0958 1.1011 1.1003 1.0999 1.0905 1.1091 1.0446 1.0981
irintensity: 2.0304 0.3264 2.7812 3.3843 0.6965 45.5477 9.9199 9.8038 16.4337 3.1899 353.5509 1.5289 6.0515 5.3930 76.3974 1.4843 2.3319 7.6789 0.8136 4.3837 30.1493 0.5957 13.9936 11.6430 35.2907 1.9310 10.2386 1.6053 12.2375 19.7690 1.1849 0.1642 2.9731 8.1895 24.3478 12.9505 3.0001 11.9770 11.4538 11.9345 21.8541 23.8898 37.6738 29.4226 29.6373 66.3557 7.6063 41.7147 20.1345 13.8740 3.0182 6.8707 1.7796 0.8844
temp: 298.150 k
press: 1.00000 atm
elementType: 7 7 7 6 6 6 6 6 6 1 1 1 1 1 1 1 1 1 1 1
symmnumber: 1
zpe: 444004.4 jmol-1
zpe.correction: 0.169112 hartree
zpe.thermalcorrener: 0.178900 hartree
zpe.thermalcorrenthalpy: 0.179845 hartree
zpe.thermalcorrgfe: 0.133533 hartree
zpe.sumelectzpe: -398.770745 hartree
zpe.sumelectthermal: -398.760957 hartree
zpe.sumelectthermalent: -398.760013 hartree
zpe.sumelectthermalfe: -398.806325 hartree
dipole: 0.1705 3.9712 1.0211
dipole: 4.1039
quadrupole: -51.9891 -53.3292 -57.5457
quadrupole: -5.0149 7.7743 1.4597
quadrupole: 2.2989 0.9588 -3.2577 -5.0149 7.7743 1.4597
hfenergy: -398.9398577 hartree
pointgroup: C01 [X(C6H11N3)]
dipole: -0.0887085 -1.5779723 0.33034 debye
dipolederiv: -0.1258643 -0.2107348 0.0004704 -0.089771 -0.7245671 -0.0277586 0.0201568 0.048312 -0.1008152 -0.4143806 -0.048156 0.012024 -0.1180347 -0.5288774 -0.0220787 0.0461372 -0.006071 -0.2677718 -1.0540558 -0.0266044 -0.2361344 -0.0766373 -0.1805611 -0.078598 -0.3557472 -0.0701659 -0.5898515 -0.2803442 -0.0014999 -0.0375498 -0.0594996 0.1153355 -0.0649185 -0.2782866 -0.0589955 0.0456023 0.3649171 -0.1322936 -0.0721175 0.0617495 0.5232833 0.048476 -0.192652 0.0735238 -0.0623424 0.8231383 -0.004718 0.1028975 0.0087594 0.2026226 0.0478674 0.2444251 0.035515 0.3111372 -0.1302752 0.257739 -0.0430855 0.0795214 0.0988005 -0.0058292 -0.0094081 -0.0531264 -0.2050049 0.1410878 0.0938333 0.0558579 0.0205857 0.4700258 0.0343433 0.0426689 -0.0025713 0.2231287 0.1108016 0.0315554 -0.0860325 0.0859939 0.0349499 0.009965 -0.063853 0.0052366 -0.1605761 -0.0107555 -0.0269198 0.0285158 -0.0698857 -0.0617338 0.1581169 0.0418734 0.1017049 -0.0281802 0.0476534 0.031357 0.0187469 0.0761762 -0.0486691 -0.0988028 0.0185446 -0.0491627 0.0407765 -0.0074721 0.0600897 0.025653 0.0721064 -0.1099916 -0.1211039 -0.0006964 -0.089797 0.0045536 0.0277496 -0.0387098 0.0223137 -0.0402113 -0.0286894 0.1166323 -0.0024147 0.0820034 -0.0239162 0.0411987 0.0481482 0.0516308 0.0961382 0.0280002 -0.0386528 0.0571669 -0.0243719 0.2106999 -0.0265681 0.1317661 -0.0865428 0.0375191 -0.0464524 0.0315711 -0.0709082 0.0603182 0.0698188 -0.0411306 -0.0811976 0.0939724 -0.0139999 0.0829645 -0.022374 0.098033 0.0176714 0.045108 0.0927389 -0.040383 -0.0313869 -0.0305264 -0.0378908 -0.0327218 -0.0463018 -0.1220976 -0.1028388 -0.0085522 -0.0679011 0.0420805 -0.1037068 0.0416566 0.0147326 0.0434286 0.0054029 0.1791757 0.2256553 -0.02192 0.0767628 0.0269341 0.0563805 -0.0634907 0.2107325 -0.1186394 0.2452493 0.2244581 0.0465493 0.0619238 0.036789 0.1134135 0.1146245 0.197101 0.1653106 0.1660471 unknown
polarizability: 106.0929567|1.3475833|86.5574573|-6.374452|1.9928681|54.6987568 unknown
InChI: InChI=1S/C6H11N3/c1-9-5-4-8-6(9)2-3-7/h4-5H,2-3,7H2,1H3
charge 0 multiplicity 1
20 atoms
N  1.019266 -0.776665 0.075921
N  0.910488 1.479286 0.281399
N  -3.619333 0.060394 -0.269427
C  -1.255778 0.242785 0.71273
C  0.206145 0.325742 0.381712
C  -2.17563 0.063465 -0.545494
C  2.296836 -0.280691 -0.229626
C  0.634258 -2.192401 0.049547
C  2.208725 1.105431 -0.097924
H  -1.466738 -0.575853 1.430996
H  -1.523855 1.190368 1.212394
H  -1.917171 -0.880873 -1.063073
H  -1.954234 0.880734 -1.255399
H  3.120956 -0.937608 -0.496573
H  1.420405 -2.809441 0.517195
H  -0.298464 -2.334905 0.617621
H  0.473103 -2.547472 -0.984687
H  2.989026 1.848934 -0.243452
H  -3.997272 0.961159 0.037177
H  -3.947434 -0.71509 0.313464
