program: Gaussian 09
title: 000159348
version: EM64L-G09RevD.01
frameworkgroup: C1[X(C20H29N7O2)]
method: RPBEPBE
basis: SDD
operation: Freq
keyword: #p
keyword: freq=noraman
keyword: PBEPBE/SDD
title: #p freq=noraman PBEPBE/SDD
converged: YES YES NO NO
title: Mulliken charges:
elementType: O O N N N N N N N C C C C C C C C C C C C C C C C C C C C H H H H H H H H H H H H H H H H H H H H H H H H H H H H H
charge: -0.158313 -0.191457 -0.141882 -0.429951 -0.018166 -0.121286 -0.580651 -0.644257 -0.661394 -0.241298 -0.472341 -0.361863 -0.460200 -0.057890 -0.376297 0.257553 -0.412513 -0.191218 -0.460028 0.245475 -0.301189 -0.577179 0.481024 0.214525 -0.424201 -0.394697 -0.231265 -0.241171 -0.245874 0.207186 0.255727 0.220473 0.186516 0.254738 0.250229 0.223827 0.218346 0.235428 0.233895 0.225494 0.204034 0.306182 0.226016 0.182343 0.218072 0.233916 0.240205 0.277843 0.343318 0.237185 0.256341 0.225626 0.231669 0.230203 0.338169 0.315119 0.301803 0.318102
chargesum: 0.00000
title: Mulliken charges with hydrogens summed into heavy atoms:
elementType: O O N N N N N N N C C C C C C C C C C C C C C C C C C C C
charge: -0.158313 -0.191457 -0.141882 -0.123769 -0.018166 -0.121286 0.040510 0.009031 -0.041488 -0.034112 0.003858 0.079391 0.013856 0.160457 0.093027 0.257553 0.017016 -0.191218 -0.051669 0.245475 -0.083117 -0.103058 0.481024 0.214525 -0.187016 -0.138356 -0.005639 -0.009503 -0.015671
polarizability: 2.63126253e+02 -1.25310922e+01 3.05359493e+02 1.06035248e+01 9.00319971e+00 2.16050914e+02
1716.lowfreq: -8.4323 -4.1562 0.0005 0.0006 0.0007 2.6031 12.8524 19.7413 23.3036
frequency: 12.1776 19.6638 23.2660 34.3943 35.5106 36.0926 40.3800 50.2005 60.2504 70.5047 78.9845 99.3504 100.3160 106.4952 117.7953 128.9560 152.6070 172.1156 183.7689 195.8932 204.6074 217.5171 251.5340 257.1038 263.7370 275.5319 287.9231 301.7675 312.0439 321.5507 353.9421 369.2548 384.6387 395.3228 404.1318 422.9378 442.0499 450.9471 466.5268 470.7240 491.6613 502.8976 554.3949 565.9368 575.1534 589.6888 617.4108 625.9195 631.0765 672.9149 682.2376 700.2844 707.0728 721.0380 736.7078 742.9759 756.3991 758.4511 780.5103 807.6874 817.2593 819.4134 849.2224 858.2953 869.1646 889.8093 896.7663 914.2462 923.7917 926.0746 930.3860 966.1149 967.3306 971.9646 979.5834 990.0596 992.3751 999.9262 1026.5387 1030.0214 1043.0536 1048.6966 1053.2398 1076.1002 1076.8180 1090.7188 1093.0180 1099.8763 1121.1655 1136.7676 1144.7969 1148.7171 1158.1971 1159.7641 1171.7044 1176.0601 1188.4306 1191.1453 1197.6065 1209.2232 1220.2653 1226.6052 1235.2096 1255.1992 1268.9691 1288.3955 1297.5506 1299.3953 1303.9911 1314.9116 1317.9697 1321.1160 1330.3741 1342.7817 1356.4292 1363.8216 1372.4653 1374.2925 1381.1571 1397.4688 1432.0805 1439.5457 1456.3695 1458.2462 1461.6771 1470.9668 1472.8558 1472.9924 1483.6752 1493.0048 1590.2781 1610.5329 1612.9687 1622.1282 1641.2038 1662.9738 1675.8545 1677.9087 2193.2623 2791.8976 2840.0889 2870.7361 2871.1149 2954.6642 2981.0822 2988.7349 2999.9065 3003.4496 3011.5858 3027.2829 3042.2104 3054.2133 3069.0300 3072.5092 3077.0643 3099.7262 3111.7116 3121.2474 3132.6827 3143.8202 3161.6939 3318.8889 3475.6885 3499.7909 3504.1377 3546.4934 3614.0399 3688.2889
redmass: 5.2289 5.6438 5.0994 5.0222 4.6740 5.0938 4.5922 4.0431 4.7597 5.3500 4.7937 4.6474 4.1754 4.3342 5.6904 5.3414 4.1271 3.2313 3.7507 4.0248 3.2756 3.8646 3.3699 2.3072 2.9243 3.3665 4.4109 3.7272 3.8333 4.6623 2.2677 2.1471 2.7157 2.1395 2.8343 1.6399 1.3572 1.9067 1.2015 4.5281 2.6517 3.1941 3.4996 2.2955 2.8424 4.5036 6.3287 3.2660 2.9596 1.1565 3.6117 5.1689 2.0129 3.2949 2.2946 3.4874 2.0297 1.5838 2.5457 1.5324 3.6449 3.3093 2.8237 1.2468 1.9756 2.5488 1.7998 2.1978 2.0670 2.1211 3.0433 2.6530 2.0939 2.2750 1.4293 5.5900 2.2257 1.5561 2.1995 2.0776 1.7475 2.1166 2.2303 1.7378 2.0819 3.0015 2.0003 2.3830 1.8294 1.8182 1.5765 1.5897 1.9848 1.4104 1.0538 2.2369 1.1243 1.9886 2.2250 1.4504 2.2123 1.2299 1.3039 1.4523 1.2296 1.2138 1.4040 1.3131 1.2729 1.5036 1.3204 1.3439 1.2635 1.4463 1.4012 1.4588 1.4459 1.4715 4.5233 4.0733 1.8633 2.1599 1.0814 1.0862 1.0905 1.0911 1.1128 1.1102 2.2222 1.0928 5.9814 1.1903 6.0557 1.3286 4.2694 1.1285 3.8708 5.5141 12.5801 1.0779 1.0820 1.0722 1.0648 1.0898 1.0841 1.0625 1.0587 1.0605 1.0619 1.0619 1.1009 1.0893 1.1030 1.1045 1.1024 1.1061 1.0873 1.0864 1.0914 1.0960 1.1014 1.0552 1.0460 1.0761 1.0882 1.0459 1.0985 1.1023
irintensity: 0.0544 0.9144 5.7096 2.4877 0.9490 0.6585 5.5845 0.4266 2.6068 0.2882 1.1677 0.9946 1.5195 9.8626 0.2361 4.8563 1.4949 1.3406 3.2693 2.4443 0.7280 12.6956 10.3595 1.9711 23.5948 3.8784 1.0121 1.4987 2.0835 1.6495 3.6531 28.6168 19.5678 16.0814 0.0211 89.6005 16.0724 94.2556 268.7697 22.9716 6.9097 45.6269 6.9934 0.9727 2.0847 0.7863 0.1789 21.8647 21.7481 111.0486 12.3737 17.0890 58.0872 61.0964 137.5913 86.3441 15.2268 8.6117 108.6607 216.9626 3.0122 4.8639 12.0382 0.5410 5.0389 12.7102 2.2049 0.9585 9.0093 1.0484 3.4527 4.3648 5.7855 8.5211 0.6984 0.0539 2.1265 0.7601 4.8829 3.0062 15.6849 2.5072 2.5662 7.4246 10.6732 34.6450 16.7700 2.5265 21.5130 125.1707 28.0298 67.8994 47.8842 10.5314 0.1778 54.5938 0.1599 2.2516 23.7201 4.5504 1.4678 24.5256 10.5458 7.3671 1.8461 3.5136 0.7335 7.6068 7.2230 3.2211 13.9441 23.4767 0.6101 0.2327 32.2708 5.2617 1.0172 4.4012 0.2638 119.4723 537.1134 6.9051 4.5907 29.1468 8.6039 11.9689 17.0381 1.9516 17.1409 3.0588 1.5297 130.4095 9.0881 76.1724 22.5416 67.1159 283.9400 276.6015 4.9618 64.5365 83.3485 104.0542 69.2962 42.1901 22.1467 28.0732 45.1542 28.5414 26.5181 25.5644 9.4164 28.5608 9.7714 31.4082 11.3564 32.1979 7.8600 1.0696 11.2560 33.9349 19.2805 214.1508 10.5002 4.5509 38.8275 24.5716 14.7685 22.0731
temp: 298.150 k
press: 1.00000 atm
elementType: 8 8 7 7 7 7 7 7 7 6 6 6 6 6 6 6 6 6 6 6 6 6 6 6 6 6 6 6 6 1 1 1 1 1 1 1 1 1 1 1 1 1 1 1 1 1 1 1 1 1 1 1 1 1 1 1 1 1
symmnumber: 1
zpe: 1257676.2 jmol-1
zpe.correction: 0.479024 hartree
zpe.thermalcorrener: 0.509233 hartree
zpe.thermalcorrenthalpy: 0.510177 hartree
zpe.thermalcorrgfe: 0.413656 hartree
zpe.sumelectzpe: -1311.027690 hartree
zpe.sumelectthermal: -1310.997480 hartree
zpe.sumelectthermalent: -1310.996536 hartree
zpe.sumelectthermalfe: -1311.093058 hartree
dipole: -2.1579 3.9662 -4.9395
dipole: 6.6922
quadrupole: -195.3142 -146.6135 -178.5881
quadrupole: 31.5215 6.4403 8.2896
quadrupole: -21.8089 26.8918 -5.0828 31.5215 6.4403 8.2896
hfenergy: -1311.5067133 hartree
pointgroup: C01 [X(C20H29N7O2)]
dipole: -1.0048548 -1.6221478 1.8141481 debye
polarizability: 264.8590858|13.2707255|303.6382035|-6.7819994|14.0563983|216.0393708 unknown
InChI: InChI=1S/C20H29N7O2/c21-13-15(8-4-10-25-20(23)24)27-11-5-9-17(27)19(29)26-18(28)16(22)12-14-6-2-1-3-7-14/h1-3,6-7,15-17,26H,4-5,8-12,22-24H2
charge 0 multiplicity 1
58 atoms
O  0.395675 1.189031 -2.053281
O  -1.21739 -1.260415 -2.433608
N  1.853095 2.433466 0.190438
N  -0.690162 -0.13394 -0.423848
N  5.309984 2.776971 0.497535
N  2.674779 -2.752836 1.032141
N  -1.733118 -3.58135 -0.698254
N  2.720897 -4.576483 -0.580196
N  0.913346 -4.311367 0.905513
C  0.474663 1.918959 0.311665
C  -0.436011 3.197317 0.288984
C  1.864764 3.91007 0.357061
C  0.502861 4.314105 -0.234847
C  2.911771 1.641064 0.850899
C  2.950999 0.176368 0.325174
C  0.092069 0.971007 -0.861563
C  4.049027 -0.694536 0.964349
C  4.23221 2.287665 0.644013
C  3.926191 -2.16444 0.508545
C  -1.296579 -1.159698 -1.183658
C  -2.088596 -2.200964 -0.337337
C  -3.617432 -1.962663 -0.547881
C  -4.0807 -0.594897 -0.070507
C  2.171876 -3.820835 0.463649
C  -4.417816 -0.384016 1.292859
C  -4.146896 0.508071 -0.96164
C  -4.808801 0.893243 1.755544
C  -4.538351 1.786701 -0.503729
C  -4.869536 1.984709 0.857278
H  0.323077 1.37165 1.276393
H  -1.333985 3.061895 -0.336692
H  -0.771312 3.424741 1.31735
H  1.936522 4.218749 1.429849
H  2.719183 4.351162 -0.183849
H  0.554343 4.283173 -1.336369
H  0.181819 5.320616 0.08283
H  2.760056 1.598118 1.96542
H  1.978401 -0.301745 0.543938
H  3.066911 0.210316 -0.774176
H  5.051751 -0.310968 0.694316
H  3.965194 -0.667432 2.068592
H  -0.866972 -0.17576 0.584567
H  4.802452 -2.729131 0.895508
H  3.983865 -2.192699 -0.608228
H  -1.861718 -2.064928 0.739784
H  -3.828968 -2.093596 -1.626375
H  -4.131369 -2.774304 -0.002398
H  -1.841225 -3.742753 -1.708294
H  -0.793454 -3.852524 -0.35978
H  -4.389988 -1.230899 1.990927
H  -3.888828 0.361473 -2.017706
H  -5.076972 1.034966 2.808911
H  -4.591943 2.623994 -1.208943
H  -5.180932 2.973896 1.211518
H  3.636326 -4.327497 -0.944905
H  2.121077 -5.151214 -1.16886
H  0.814685 -5.327976 0.977699
H  0.562887 -3.791531 1.714076
